Taxon,"Gene ID","Gene Symbol",Transcript,"Clone ID","Legacy Clone Name","Target Seq",Vector,"Match Position","Match Region","Match %","SDR Match %","Intrinsic Score","Adjusted Score","Matches Other Gene in Same Taxon?","Orig. Target Gene ID","Orig. Target Gene Symbol","Forward Oligo Sequence","Reverse Oligo Sequence",Addgene
human,105373618,LOC105373618,XR_923330.3,TRCN0000155836,NM_198582.1-3275s1c1,CCCAAAGTGCTGGGATTACAA,pLKO.1,175,3UTR,95,100,5.625,2.8125,Y,377007,KLHL30,CCGGCCCAAAGTGCTGGGATTACAACTCGAGTTGTAATCCCAGCACTTTGGGTTTTTG,AATTCAAAAACCCAAAGTGCTGGGATTACAACTCGAGTTGTAATCCCAGCACTTTGGG,n/a
human,105373618,LOC105373618,XR_923330.3,TRCN0000141025,NM_152361.1-835s1c1,CCCAAAGTGCTGGGATTACTT,pLKO.1,175,3UTR,90,100,5.625,2.8125,Y,126272,EID2B,CCGGCCCAAAGTGCTGGGATTACTTCTCGAGAAGTAATCCCAGCACTTTGGGTTTTTG,AATTCAAAAACCCAAAGTGCTGGGATTACTTCTCGAGAAGTAATCCCAGCACTTTGGG,n/a
human,105373618,LOC105373618,XR_923330.3,TRCN0000148148,NM_152654.1-1281s1c1,GAGACAGAGTTTCACCATATT,pLKO.1,104,3UTR,95,95,,,Y,199699,DAND5,CCGGGAGACAGAGTTTCACCATATTCTCGAGAATATGGTGAAACTCTGTCTCTTTTTG,AATTCAAAAAGAGACAGAGTTTCACCATATTCTCGAGAATATGGTGAAACTCTGTCTC,n/a
human,105373618,LOC105373618,XR_923330.3,TRCN0000204533,NM_001013675.1-1987s1c1,CCTCCCAAAGTGCTGGAATTA,pLKO.1,172,3UTR,95,95,,,Y,400891,LRRC74B,CCGGCCTCCCAAAGTGCTGGAATTACTCGAGTAATTCCAGCACTTTGGGAGGTTTTTG,AATTCAAAAACCTCCCAAAGTGCTGGAATTACTCGAGTAATTCCAGCACTTTGGGAGG,n/a
human,105373618,LOC105373618,XR_923330.3,TRCN0000072628,NM_016065.3-1636s1c1,CCTCCCAAAGTGCTAGGATTA,pLKO.1,172,3UTR,95,95,,,Y,51021,MRPS16,CCGGCCTCCCAAAGTGCTAGGATTACTCGAGTAATCCTAGCACTTTGGGAGGTTTTTG,AATTCAAAAACCTCCCAAAGTGCTAGGATTACTCGAGTAATCCTAGCACTTTGGGAGG,n/a
human,105373618,LOC105373618,XR_923330.3,TRCN0000165534,NM_001012717.1-362s1c1,GAGACAGGGTTTCACCATGTT,pLKO.1,104,3UTR,95,95,,,Y,,,CCGGGAGACAGGGTTTCACCATGTTCTCGAGAACATGGTGAAACCCTGTCTCTTTTTG,AATTCAAAAAGAGACAGGGTTTCACCATGTTCTCGAGAACATGGTGAAACCCTGTCTC,n/a
human,105373618,LOC105373618,XR_923330.3,TRCN0000164801,NM_016534.2-1646s1c1,CCTCCCAAAGTACTGGGATTA,pLKO.1,172,3UTR,95,95,,,Y,51275,MAPKAPK5-AS1,CCGGCCTCCCAAAGTACTGGGATTACTCGAGTAATCCCAGTACTTTGGGAGGTTTTTG,AATTCAAAAACCTCCCAAAGTACTGGGATTACTCGAGTAATCCCAGTACTTTGGGAGG,n/a
human,105373618,LOC105373618,XR_923330.3,TRCN0000008902,NM_016540.2-2291s1c1,CCTCCCAAAGTGTTGGGATTA,pLKO.1,172,3UTR,95,95,,,Y,10888,GPR83,CCGGCCTCCCAAAGTGTTGGGATTACTCGAGTAATCCCAACACTTTGGGAGGTTTTTG,AATTCAAAAACCTCCCAAAGTGTTGGGATTACTCGAGTAATCCCAACACTTTGGGAGG,n/a
human,105373618,LOC105373618,XR_923330.3,TRCN0000156315,NM_020702.1-3633s1c1,CCTCCCAAAGTGTTGGGATTA,pLKO.1,172,3UTR,95,95,,,Y,57462,MYORG,CCGGCCTCCCAAAGTGTTGGGATTACTCGAGTAATCCCAACACTTTGGGAGGTTTTTG,AATTCAAAAACCTCCCAAAGTGTTGGGATTACTCGAGTAATCCCAACACTTTGGGAGG,n/a
human,105373618,LOC105373618,XR_923330.3,TRCN0000116227,NM_024930.1-2895s1c1,CCTCCCAAAGTTCTGGGATTA,pLKO.1,172,3UTR,95,95,,,Y,79993,ELOVL7,CCGGCCTCCCAAAGTTCTGGGATTACTCGAGTAATCCCAGAACTTTGGGAGGTTTTTG,AATTCAAAAACCTCCCAAAGTTCTGGGATTACTCGAGTAATCCCAGAACTTTGGGAGG,n/a
human,105373618,LOC105373618,XR_923330.3,TRCN0000164591,NM_003281.3-2102s1c1,CCTCCCAAAGTTCTGGGATTA,pLKO.1,172,3UTR,95,95,,,Y,7135,TNNI1,CCGGCCTCCCAAAGTTCTGGGATTACTCGAGTAATCCCAGAACTTTGGGAGGTTTTTG,AATTCAAAAACCTCCCAAAGTTCTGGGATTACTCGAGTAATCCCAGAACTTTGGGAGG,n/a
human,105373618,LOC105373618,XR_923330.3,TRCN0000040213,NM_000618.2-6169s1c1,CCTCCCAAATTGCTGGGATTA,pLKO.1,172,3UTR,95,95,,,Y,3479,IGF1,CCGGCCTCCCAAATTGCTGGGATTACTCGAGTAATCCCAGCAATTTGGGAGGTTTTTG,AATTCAAAAACCTCCCAAATTGCTGGGATTACTCGAGTAATCCCAGCAATTTGGGAGG,n/a
human,105373618,LOC105373618,XR_923330.3,TRCN0000162795,NM_017842.1-1079s1c1,CTTCCAAAGTGCTGGGATTAT,pLKO.1,173,3UTR,90,95,,,Y,55652,SLC48A1,CCGGCTTCCAAAGTGCTGGGATTATCTCGAGATAATCCCAGCACTTTGGAAGTTTTTG,AATTCAAAAACTTCCAAAGTGCTGGGATTATCTCGAGATAATCCCAGCACTTTGGAAG,n/a
human,105373618,LOC105373618,XR_923330.3,TRCN0000140657,NM_012099.1-2957s1c1,CCTCCCAAAGTGCTAGGATAA,pLKO.1,172,3UTR,90,95,,,Y,10849,CD3EAP,CCGGCCTCCCAAAGTGCTAGGATAACTCGAGTTATCCTAGCACTTTGGGAGGTTTTTG,AATTCAAAAACCTCCCAAAGTGCTAGGATAACTCGAGTTATCCTAGCACTTTGGGAGG,n/a
human,105373618,LOC105373618,XR_923330.3,TRCN0000139610,NM_032120.1-1494s1c1,CGAACTCCTGACCTTGTGATA,pLKO.1,139,3UTR,90,95,,,Y,84060,RBM48,CCGGCGAACTCCTGACCTTGTGATACTCGAGTATCACAAGGTCAGGAGTTCGTTTTTG,AATTCAAAAACGAACTCCTGACCTTGTGATACTCGAGTATCACAAGGTCAGGAGTTCG,n/a
human,105373618,LOC105373618,XR_923330.3,TRCN0000104308,NM_012052.1-50s1c1,CATCTTCAAAGCTGAGCTGAA,pLKO.1,2783,3UTR,90,95,,,Y,27050,Rps3,CCGGCATCTTCAAAGCTGAGCTGAACTCGAGTTCAGCTCAGCTTTGAAGATGTTTTTG,AATTCAAAAACATCTTCAAAGCTGAGCTGAACTCGAGTTCAGCTCAGCTTTGAAGATG,n/a
human,105373618,LOC105373618,XR_923330.3,TRCN0000323840,NM_012052.2-133s21c1,CATCTTCAAAGCTGAGCTGAA,pLKO_005,2783,3UTR,90,95,,,Y,27050,Rps3,CCGGCATCTTCAAAGCTGAGCTGAACTCGAGTTCAGCTCAGCTTTGAAGATGTTTTTG,AATTCAAAAACATCTTCAAAGCTGAGCTGAACTCGAGTTCAGCTCAGCTTTGAAGATG,n/a
human,105373618,LOC105373618,XR_923330.3,TRCN0000319523,NM_009013.3-105s21c1,CAATGACTCTGATGATGATTT,pLKO_005,1837,3UTR,90,90,,,N,19362,Rad51ap1,CCGGCAATGACTCTGATGATGATTTCTCGAGAAATCATCATCAGAGTCATTGTTTTTG,AATTCAAAAACAATGACTCTGATGATGATTTCTCGAGAAATCATCATCAGAGTCATTG,n/a
human,105373618,LOC105373618,XR_923330.3,TRCN0000047783,NM_017516.1-1624s1c1,GCCTCCAAAGTGCTGGAATTA,pLKO.1,171,3UTR,90,90,,,Y,54734,RAB39A,CCGGGCCTCCAAAGTGCTGGAATTACTCGAGTAATTCCAGCACTTTGGAGGCTTTTTG,AATTCAAAAAGCCTCCAAAGTGCTGGAATTACTCGAGTAATTCCAGCACTTTGGAGGC,n/a
human,105373618,LOC105373618,XR_923330.3,TRCN0000282346,NM_001080829.1-94s21c1,GCCACACTGAGCGATGATGAA,pLKO_005,1755,3UTR,81,90,,,N,390688,CDC37P1,CCGGGCCACACTGAGCGATGATGAACTCGAGTTCATCATCGCTCAGTGTGGCTTTTTG,AATTCAAAAAGCCACACTGAGCGATGATGAACTCGAGTTCATCATCGCTCAGTGTGGC,n/a
human,105373618,LOC105373618,XR_923330.3,TRCN0000131178,NM_145303.1-410s1c1,GCATCCAGCTTCCTGTTTACA,pLKO.1,4479,3UTR,81,90,,,Y,202459,OSTCP1,CCGGGCATCCAGCTTCCTGTTTACACTCGAGTGTAAACAGGAAGCTGGATGCTTTTTG,AATTCAAAAAGCATCCAGCTTCCTGTTTACACTCGAGTGTAAACAGGAAGCTGGATGC,n/a
human,105373618,LOC105373618,XR_923330.3,TRCN0000166316,NM_033053.1-300s1c1,CACTGGGAAGGAGAACAACAT,pLKO.1,5587,3UTR,81,90,,,Y,63947,DMRTC1,CCGGCACTGGGAAGGAGAACAACATCTCGAGATGTTGTTCTCCTTCCCAGTGTTTTTG,AATTCAAAAACACTGGGAAGGAGAACAACATCTCGAGATGTTGTTCTCCTTCCCAGTG,n/a
human,105373618,LOC105373618,XR_923330.3,TRCN0000109217,NM_133701.1-2566s1c1,GCCCTGAAGAAGTGTGAACAT,pLKO.1,718,3UTR,90,89,,,Y,68879,Prpf6,CCGGGCCCTGAAGAAGTGTGAACATCTCGAGATGTTCACACTTCTTCAGGGCTTTTTG,AATTCAAAAAGCCCTGAAGAAGTGTGAACATCTCGAGATGTTCACACTTCTTCAGGGC,n/a
human,105373618,LOC105373618,XR_923330.3,TRCN0000317564,NM_133701.2-2639s21c1,GCCCTGAAGAAGTGTGAACAT,pLKO_005,718,3UTR,90,89,,,Y,68879,Prpf6,CCGGGCCCTGAAGAAGTGTGAACATCTCGAGATGTTCACACTTCTTCAGGGCTTTTTG,AATTCAAAAAGCCCTGAAGAAGTGTGAACATCTCGAGATGTTCACACTTCTTCAGGGC,n/a
human,105373618,LOC105373618,XR_923330.3,TRCN0000202363,NM_026846.1-339s1c1,GAGCACATTGACAGAGACTGT,pLKO.1,401,3UTR,90,89,,,Y,68818,Zfand2b,CCGGGAGCACATTGACAGAGACTGTCTCGAGACAGTCTCTGTCAATGTGCTCTTTTTG,AATTCAAAAAGAGCACATTGACAGAGACTGTCTCGAGACAGTCTCTGTCAATGTGCTC,n/a
human,105373618,LOC105373618,XR_923330.3,TRCN0000292701,NM_026846.2-338s21c1,GAGCACATTGACAGAGACTGT,pLKO_005,401,3UTR,90,89,,,Y,68818,Zfand2b,CCGGGAGCACATTGACAGAGACTGTCTCGAGACAGTCTCTGTCAATGTGCTCTTTTTG,AATTCAAAAAGAGCACATTGACAGAGACTGTCTCGAGACAGTCTCTGTCAATGTGCTC,n/a
human,105373618,LOC105373618,XR_923330.3,TRCN0000042823,NM_024055.2-973s1c1,CCTCACAAAGTGCTAGGATTA,pLKO.1,172,3UTR,90,89,,,Y,64924,SLC30A5,CCGGCCTCACAAAGTGCTAGGATTACTCGAGTAATCCTAGCACTTTGTGAGGTTTTTG,AATTCAAAAACCTCACAAAGTGCTAGGATTACTCGAGTAATCCTAGCACTTTGTGAGG,n/a
human,105373618,LOC105373618,XR_923330.3,TRCN0000082462,XM_371492.2-638s1c1,CCTCCCAAAGTGCCAGGATTA,pLKO.1,172,3UTR,90,89,,,Y,388949,LOC388949,CCGGCCTCCCAAAGTGCCAGGATTACTCGAGTAATCCTGGCACTTTGGGAGGTTTTTG,AATTCAAAAACCTCCCAAAGTGCCAGGATTACTCGAGTAATCCTGGCACTTTGGGAGG,n/a
human,105373618,LOC105373618,XR_923330.3,TRCN0000165736,NM_175901.3-1946s1c1,CCTCCCTAAGTGTTGGGATTA,pLKO.1,172,3UTR,90,89,,,Y,283932,FBXL19-AS1,CCGGCCTCCCTAAGTGTTGGGATTACTCGAGTAATCCCAACACTTAGGGAGGTTTTTG,AATTCAAAAACCTCCCTAAGTGTTGGGATTACTCGAGTAATCCCAACACTTAGGGAGG,n/a
human,105373618,LOC105373618,XR_923330.3,TRCN0000166560,NM_207497.1-412s1c1,CCTCCGAAAGTGCTAGGATTA,pLKO.1,172,3UTR,90,89,,,Y,401253,LINC00336,CCGGCCTCCGAAAGTGCTAGGATTACTCGAGTAATCCTAGCACTTTCGGAGGTTTTTG,AATTCAAAAACCTCCGAAAGTGCTAGGATTACTCGAGTAATCCTAGCACTTTCGGAGG,n/a
human,105373618,LOC105373618,XR_923330.3,TRCN0000164091,NM_024795.1-1273s1c1,CCTCCTAAAGTGCTGCGATTA,pLKO.1,172,3UTR,90,89,,,Y,79853,TM4SF20,CCGGCCTCCTAAAGTGCTGCGATTACTCGAGTAATCGCAGCACTTTAGGAGGTTTTTG,AATTCAAAAACCTCCTAAAGTGCTGCGATTACTCGAGTAATCGCAGCACTTTAGGAGG,n/a
human,105373618,LOC105373618,XR_923330.3,TRCN0000162985,NM_207497.1-342s1c1,GAGACAAGGTTTCACCATGTT,pLKO.1,104,3UTR,90,89,,,Y,401253,LINC00336,CCGGGAGACAAGGTTTCACCATGTTCTCGAGAACATGGTGAAACCTTGTCTCTTTTTG,AATTCAAAAAGAGACAAGGTTTCACCATGTTCTCGAGAACATGGTGAAACCTTGTCTC,n/a
human,105373618,LOC105373618,XR_923330.3,TRCN0000168774,NM_001013670.1-1394s1c1,GAGATGGAGTTTCACCATGTT,pLKO.1,104,3UTR,90,89,,,Y,400464,LOC400464,CCGGGAGATGGAGTTTCACCATGTTCTCGAGAACATGGTGAAACTCCATCTCTTTTTG,AATTCAAAAAGAGATGGAGTTTCACCATGTTCTCGAGAACATGGTGAAACTCCATCTC,n/a
human,105373618,LOC105373618,XR_923330.3,TRCN0000140238,NM_024895.3-1807s1c1,GTCTCCCAAAGTGCTAGGATT,pLKO.1,171,3UTR,90,89,,,Y,79955,PDZD7,CCGGGTCTCCCAAAGTGCTAGGATTCTCGAGAATCCTAGCACTTTGGGAGACTTTTTG,AATTCAAAAAGTCTCCCAAAGTGCTAGGATTCTCGAGAATCCTAGCACTTTGGGAGAC,n/a
human,105373618,LOC105373618,XR_923330.3,TRCN0000073773,NM_022164.1-1914s1c1,CCTCTCAAGTAGCTGGGACTA,pLKO.1,39,3UTR,90,89,,,Y,64129,TINAGL1,CCGGCCTCTCAAGTAGCTGGGACTACTCGAGTAGTCCCAGCTACTTGAGAGGTTTTTG,AATTCAAAAACCTCTCAAGTAGCTGGGACTACTCGAGTAGTCCCAGCTACTTGAGAGG,n/a
human,105373618,LOC105373618,XR_923330.3,TRCN0000129445,NM_145048.2-1500s1c1,GACTTCCAAAGTGCTGGGATT,pLKO.1,171,3UTR,90,89,,,Y,133015,PACRGL,CCGGGACTTCCAAAGTGCTGGGATTCTCGAGAATCCCAGCACTTTGGAAGTCTTTTTG,AATTCAAAAAGACTTCCAAAGTGCTGGGATTCTCGAGAATCCCAGCACTTTGGAAGTC,n/a
human,105373618,LOC105373618,XR_923330.3,TRCN0000140759,NM_018265.1-3067s1c1,GCCTTTCAAAGTGCTGGGATT,pLKO.1,171,3UTR,90,89,,,Y,55765,INAVA,CCGGGCCTTTCAAAGTGCTGGGATTCTCGAGAATCCCAGCACTTTGAAAGGCTTTTTG,AATTCAAAAAGCCTTTCAAAGTGCTGGGATTCTCGAGAATCCCAGCACTTTGAAAGGC,n/a
human,105373618,LOC105373618,XR_923330.3,TRCN0000155070,NM_017873.2-2761s1c1,GCCTTTCAAAGTGCTGGGATT,pLKO.1,171,3UTR,90,89,,,Y,140459,ASB6,CCGGGCCTTTCAAAGTGCTGGGATTCTCGAGAATCCCAGCACTTTGAAAGGCTTTTTG,AATTCAAAAAGCCTTTCAAAGTGCTGGGATTCTCGAGAATCCCAGCACTTTGAAAGGC,n/a
human,105373618,LOC105373618,XR_923330.3,TRCN0000163829,NM_173639.1-1102s1c1,CCTCCCAAATTACTGGGATTA,pLKO.1,172,3UTR,90,89,,,Y,284618,RUSC1-AS1,CCGGCCTCCCAAATTACTGGGATTACTCGAGTAATCCCAGTAATTTGGGAGGTTTTTG,AATTCAAAAACCTCCCAAATTACTGGGATTACTCGAGTAATCCCAGTAATTTGGGAGG,n/a
human,105373618,LOC105373618,XR_923330.3,TRCN0000057398,NM_002261.1-793s1c1,CCTCCCAAGTTGCTGGGATTA,pLKO.1,172,3UTR,90,89,,,Y,3823,KLRC3,CCGGCCTCCCAAGTTGCTGGGATTACTCGAGTAATCCCAGCAACTTGGGAGGTTTTTG,AATTCAAAAACCTCCCAAGTTGCTGGGATTACTCGAGTAATCCCAGCAACTTGGGAGG,n/a
human,105373618,LOC105373618,XR_923330.3,TRCN0000140374,NM_025042.2-1098s1c1,GCTTCCCAAAGTACTGGGATT,pLKO.1,171,3UTR,90,89,,,Y,,,CCGGGCTTCCCAAAGTACTGGGATTCTCGAGAATCCCAGTACTTTGGGAAGCTTTTTG,AATTCAAAAAGCTTCCCAAAGTACTGGGATTCTCGAGAATCCCAGTACTTTGGGAAGC,n/a
human,105373618,LOC105373618,XR_923330.3,TRCN0000146838,NM_006020.1-1551s1c1,CCACTCCATCTGGTAATTTAT,pLKO.1,70,3UTR,85,89,,,Y,8846,ALKBH1,CCGGCCACTCCATCTGGTAATTTATCTCGAGATAAATTACCAGATGGAGTGGTTTTTG,AATTCAAAAACCACTCCATCTGGTAATTTATCTCGAGATAAATTACCAGATGGAGTGG,n/a
human,105373618,LOC105373618,XR_923330.3,TRCN0000013307,NM_003923.1-1540s1c1,CCAGGGCTGCTCTGCGATCTA,pLKO.1,4879,3UTR,85,89,,,Y,8928,FOXH1,CCGGCCAGGGCTGCTCTGCGATCTACTCGAGTAGATCGCAGAGCAGCCCTGGTTTTTG,AATTCAAAAACCAGGGCTGCTCTGCGATCTACTCGAGTAGATCGCAGAGCAGCCCTGG,n/a
human,105373618,LOC105373618,XR_923330.3,TRCN0000264189,NM_001085490.1-613s21c1,CAAGTAGCTGGGACTACAGGA,pLKO_005,44,3UTR,85,89,,,Y,285501,LINC01098,CCGGCAAGTAGCTGGGACTACAGGACTCGAGTCCTGTAGTCCCAGCTACTTGTTTTTG,AATTCAAAAACAAGTAGCTGGGACTACAGGACTCGAGTCCTGTAGTCCCAGCTACTTG,n/a
human,105373618,LOC105373618,XR_923330.3,TRCN0000103350,NM_013873.3-1452s1c1,CGGAGATCAAAGAACGGGTTT,pLKO.1,5912,3UTR,80,89,,,N,29859,Sult4a1,CCGGCGGAGATCAAAGAACGGGTTTCTCGAGAAACCCGTTCTTTGATCTCCGTTTTTG,AATTCAAAAACGGAGATCAAAGAACGGGTTTCTCGAGAAACCCGTTCTTTGATCTCCG,n/a
human,105373618,LOC105373618,XR_923330.3,TRCN0000013634,NM_001730.2-869s1c1,CCCTGAGTTCACCAGTATATT,pLKO.1,2912,3UTR,80,89,,,Y,688,KLF5,CCGGCCCTGAGTTCACCAGTATATTCTCGAGAATATACTGGTGAACTCAGGGTTTTTG,AATTCAAAAACCCTGAGTTCACCAGTATATTCTCGAGAATATACTGGTGAACTCAGGG,n/a
human,105373618,LOC105373618,XR_923330.3,TRCN0000280340,NM_001730.3-882s21c1,CCCTGAGTTCACCAGTATATT,pLKO_005,2912,3UTR,80,89,,,Y,688,KLF5,CCGGCCCTGAGTTCACCAGTATATTCTCGAGAATATACTGGTGAACTCAGGGTTTTTG,AATTCAAAAACCCTGAGTTCACCAGTATATTCTCGAGAATATACTGGTGAACTCAGGG,n/a
human,105373618,LOC105373618,XR_923330.3,TRCN0000584655,,GTGGTTGGTTCCTTGATTATA,pLKO_005,2389,3UTR,80,89,,,Y,219477,OR8J1,CCGGGTGGTTGGTTCCTTGATTATACTCGAGTATAATCAAGGAACCAACCACTTTTTG,AATTCAAAAAGTGGTTGGTTCCTTGATTATACTCGAGTATAATCAAGGAACCAACCAC,n/a
human,105373618,LOC105373618,XR_923330.3,TRCN0000118221,NM_018297.2-1158s1c1,CTTTCCTATGTCATAGCATTT,pLKO.1,4997,3UTR,80,89,,,Y,55768,NGLY1,CCGGCTTTCCTATGTCATAGCATTTCTCGAGAAATGCTATGACATAGGAAAGTTTTTG,AATTCAAAAACTTTCCTATGTCATAGCATTTCTCGAGAAATGCTATGACATAGGAAAG,n/a
human,105373618,LOC105373618,XR_923330.3,TRCN0000368536,NM_024012.2-1607s21c1,TCCTAGTACATATATCCTAAT,pLKO_005,4986,3UTR,80,89,,,Y,3361,HTR5A,CCGGTCCTAGTACATATATCCTAATCTCGAGATTAGGATATATGTACTAGGATTTTTG,AATTCAAAAATCCTAGTACATATATCCTAATCTCGAGATTAGGATATATGTACTAGGA,n/a
human,105373618,LOC105373618,XR_923330.3,TRCN0000156203,NM_006836.1-8278s1c1,CAGGAGCTGTTTGTCCAGTTT,pLKO.1,803,3UTR,80,89,,,Y,10985,GCN1,CCGGCAGGAGCTGTTTGTCCAGTTTCTCGAGAAACTGGACAAACAGCTCCTGTTTTTG,AATTCAAAAACAGGAGCTGTTTGTCCAGTTTCTCGAGAAACTGGACAAACAGCTCCTG,n/a
human,105373618,LOC105373618,XR_923330.3,TRCN0000135910,NM_020154.1-634s1c1,GCCTGATGTTTCTGAGTTCAT,pLKO.1,2482,3UTR,80,89,,,Y,56851,EMC7,CCGGGCCTGATGTTTCTGAGTTCATCTCGAGATGAACTCAGAAACATCAGGCTTTTTG,AATTCAAAAAGCCTGATGTTTCTGAGTTCATCTCGAGATGAACTCAGAAACATCAGGC,n/a
human,105373618,LOC105373618,XR_923330.3,TRCN0000322774,NM_020154.2-634s21c1,GCCTGATGTTTCTGAGTTCAT,pLKO_005,2482,3UTR,80,89,,,Y,56851,EMC7,CCGGGCCTGATGTTTCTGAGTTCATCTCGAGATGAACTCAGAAACATCAGGCTTTTTG,AATTCAAAAAGCCTGATGTTTCTGAGTTCATCTCGAGATGAACTCAGAAACATCAGGC,n/a
human,105373618,LOC105373618,XR_923330.3,TRCN0000008281,NM_153024.1-1141s1c1,CCATCCTCAGATGGGAATTAT,pLKO.1,4185,3UTR,80,89,,,Y,219445,OR7E5P,CCGGCCATCCTCAGATGGGAATTATCTCGAGATAATTCCCATCTGAGGATGGTTTTTG,AATTCAAAAACCATCCTCAGATGGGAATTATCTCGAGATAATTCCCATCTGAGGATGG,n/a
human,105373618,LOC105373618,XR_923330.3,TRCN0000275460,NM_014731.2-2124s21c1,TGCCTCCACCAGCCACATTAA,pLKO_005,214,3UTR,80,89,,,Y,9762,LZTS3,CCGGTGCCTCCACCAGCCACATTAACTCGAGTTAATGTGGCTGGTGGAGGCATTTTTG,AATTCAAAAATGCCTCCACCAGCCACATTAACTCGAGTTAATGTGGCTGGTGGAGGCA,n/a
human,105373618,LOC105373618,XR_923330.3,TRCN0000241511,NM_026398.4-522s21c1,GAGAACAAAGGCCACCGTTAC,pLKO_005,660,3UTR,80,89,,,Y,117109,Pop5,CCGGGAGAACAAAGGCCACCGTTACCTCGAGGTAACGGTGGCCTTTGTTCTCTTTTTG,AATTCAAAAAGAGAACAAAGGCCACCGTTACCTCGAGGTAACGGTGGCCTTTGTTCTC,n/a
human,105373618,LOC105373618,XR_923330.3,TRCN0000037193,NM_153410.2-1523s1c1,CACTGGACAGTGCTGATGTAA,pLKO.1,314,3UTR,80,89,,,Y,67839,Gpsm1,CCGGCACTGGACAGTGCTGATGTAACTCGAGTTACATCAGCACTGTCCAGTGTTTTTG,AATTCAAAAACACTGGACAGTGCTGATGTAACTCGAGTTACATCAGCACTGTCCAGTG,n/a
human,105373618,LOC105373618,XR_923330.3,TRCN0000101355,NM_029958.1-141s1c1,CCCAGATGACAAGCTTCCAAA,pLKO.1,3951,3UTR,80,89,,,Y,77701,Lcn12,CCGGCCCAGATGACAAGCTTCCAAACTCGAGTTTGGAAGCTTGTCATCTGGGTTTTTG,AATTCAAAAACCCAGATGACAAGCTTCCAAACTCGAGTTTGGAAGCTTGTCATCTGGG,n/a
human,105373618,LOC105373618,XR_923330.3,TRCN0000190057,NM_029604.1-823s1c1,GTCTCCAGAACTGAGGACATA,pLKO.1,331,3UTR,80,89,,,Y,100503311,Pifo,CCGGGTCTCCAGAACTGAGGACATACTCGAGTATGTCCTCAGTTCTGGAGACTTTTTG,AATTCAAAAAGTCTCCAGAACTGAGGACATACTCGAGTATGTCCTCAGTTCTGGAGAC,n/a
human,105373618,LOC105373618,XR_923330.3,TRCN0000432597,NM_173432.2-387s21c1,GCAAAGTACAGGGCCAAATTT,pLKO_005,5918,3UTR,81,85,,,Y,244631,Pskh1,CCGGGCAAAGTACAGGGCCAAATTTCTCGAGAAATTTGGCCCTGTACTTTGCTTTTTG,AATTCAAAAAGCAAAGTACAGGGCCAAATTTCTCGAGAAATTTGGCCCTGTACTTTGC,n/a
human,105373618,LOC105373618,XR_923330.3,TRCN0000415608,NM_021339.2-2352s21c1,TCTGTGGAAGTTCGTAGTTTA,pLKO_005,6001,3UTR,81,85,,,Y,57810,Cdon,CCGGTCTGTGGAAGTTCGTAGTTTACTCGAGTAAACTACGAACTTCCACAGATTTTTG,AATTCAAAAATCTGTGGAAGTTCGTAGTTTACTCGAGTAAACTACGAACTTCCACAGA,n/a
human,105373618,LOC105373618,XR_923330.3,TRCN0000037437,XM_376950.1-1997s1c1,GCTGGTGTCCAGTAGTATGAA,pLKO.1,808,3UTR,81,85,,,Y,169436,STKLD1,CCGGGCTGGTGTCCAGTAGTATGAACTCGAGTTCATACTACTGGACACCAGCTTTTTG,AATTCAAAAAGCTGGTGTCCAGTAGTATGAACTCGAGTTCATACTACTGGACACCAGC,n/a
human,105373618,LOC105373618,XR_923330.3,TRCN0000084231,NM_033563.2-1194s1c1,ACAGGAAACACACAGGTGCAA,pLKO.1,4421,3UTR,77,85,,,Y,93691,Klf7,CCGGACAGGAAACACACAGGTGCAACTCGAGTTGCACCTGTGTGTTTCCTGTTTTTTG,AATTCAAAAAACAGGAAACACACAGGTGCAACTCGAGTTGCACCTGTGTGTTTCCTGT,n/a
human,105373618,LOC105373618,XR_923330.3,TRCN0000093737,NM_009143.2-668s1c1,GACTGGACAGTGCTCTGTAAT,pLKO.1,314,3UTR,77,85,,,Y,20316,Sdf2,CCGGGACTGGACAGTGCTCTGTAATCTCGAGATTACAGAGCACTGTCCAGTCTTTTTG,AATTCAAAAAGACTGGACAGTGCTCTGTAATCTCGAGATTACAGAGCACTGTCCAGTC,n/a
human,105373618,LOC105373618,XR_923330.3,TRCN0000134660,NM_017867.1-894s1c1,GAATTGGGAATGGATCTCTTT,pLKO.1,5402,3UTR,77,85,,,Y,54969,HPF1,CCGGGAATTGGGAATGGATCTCTTTCTCGAGAAAGAGATCCATTCCCAATTCTTTTTG,AATTCAAAAAGAATTGGGAATGGATCTCTTTCTCGAGAAAGAGATCCATTCCCAATTC,n/a
human,105373618,LOC105373618,XR_923330.3,TRCN0000129631,NM_020230.3-985s1c1,CAAAGTGATGTTCCACAGTTT,pLKO.1,3213,3UTR,77,85,,,Y,56342,PPAN,CCGGCAAAGTGATGTTCCACAGTTTCTCGAGAAACTGTGGAACATCACTTTGTTTTTG,AATTCAAAAACAAAGTGATGTTCCACAGTTTCTCGAGAAACTGTGGAACATCACTTTG,n/a
