Taxon,"Gene ID","Gene Symbol",Transcript,"Clone ID","Legacy Clone Name","Target Seq",Vector,"Match Position","Match Region","Match %","SDR Match %","Intrinsic Score","Adjusted Score","Matches Other Gene in Same Taxon?","Orig. Target Gene ID","Orig. Target Gene Symbol","Forward Oligo Sequence","Reverse Oligo Sequence",Addgene
human,127018,LYPLAL1,XR_001736964.2,TRCN0000418336,NM_138794.3-537s21c1,GGTGTACTTCCTGAATTATTT,pLKO_005,536,3UTR,100,100,15,12,N,127018,LYPLAL1,CCGGGGTGTACTTCCTGAATTATTTCTCGAGAAATAATTCAGGAAGTACACCTTTTTG,AATTCAAAAAGGTGTACTTCCTGAATTATTTCTCGAGAAATAATTCAGGAAGTACACC,n/a
human,127018,LYPLAL1,XR_001736964.2,TRCN0000413417,NM_138794.3-631s21c1,TAGGAGTGACCACGAAGTTTC,pLKO_005,630,3UTR,100,100,10.8,7.56,N,127018,LYPLAL1,CCGGTAGGAGTGACCACGAAGTTTCCTCGAGGAAACTTCGTGGTCACTCCTATTTTTG,AATTCAAAAATAGGAGTGACCACGAAGTTTCCTCGAGGAAACTTCGTGGTCACTCCTA,n/a
human,127018,LYPLAL1,XR_001736964.2,TRCN0000078209,NM_138794.1-274s1c1,GCCCAGAACACCTTGAATCAA,pLKO.1,300,3UTR,100,100,5.625,3.9375,N,127018,LYPLAL1,CCGGGCCCAGAACACCTTGAATCAACTCGAGTTGATTCAAGGTGTTCTGGGCTTTTTG,AATTCAAAAAGCCCAGAACACCTTGAATCAACTCGAGTTGATTCAAGGTGTTCTGGGC,n/a
human,127018,LYPLAL1,XR_001736964.2,TRCN0000078212,NM_138794.1-442s1c1,GAGTATTTGCTCTTTCTAGTT,pLKO.1,468,3UTR,100,100,4.95,3.465,N,127018,LYPLAL1,CCGGGAGTATTTGCTCTTTCTAGTTCTCGAGAACTAGAAAGAGCAAATACTCTTTTTG,AATTCAAAAAGAGTATTTGCTCTTTCTAGTTCTCGAGAACTAGAAAGAGCAAATACTC,n/a
human,127018,LYPLAL1,XR_001736964.2,TRCN0000078208,NM_138794.1-546s1c1,GCAGATGAGTTAGTTCTTCAT,pLKO.1,572,3UTR,100,100,4.95,3.465,N,127018,LYPLAL1,CCGGGCAGATGAGTTAGTTCTTCATCTCGAGATGAAGAACTAACTCATCTGCTTTTTG,AATTCAAAAAGCAGATGAGTTAGTTCTTCATCTCGAGATGAAGAACTAACTCATCTGC,n/a
human,127018,LYPLAL1,XR_001736964.2,TRCN0000078211,NM_138794.1-633s1c1,CCAAATGTTTACCATGAGCTA,pLKO.1,659,3UTR,100,100,2.64,1.848,N,127018,LYPLAL1,CCGGCCAAATGTTTACCATGAGCTACTCGAGTAGCTCATGGTAAACATTTGGTTTTTG,AATTCAAAAACCAAATGTTTACCATGAGCTACTCGAGTAGCTCATGGTAAACATTTGG,n/a
human,127018,LYPLAL1,XR_001736964.2,TRCN0000078210,NM_138794.1-200s1c1,TCCCAGATCATATACTCCTAT,pLKO.1,226,3UTR,95,95,,,N,127018,LYPLAL1,CCGGTCCCAGATCATATACTCCTATCTCGAGATAGGAGTATATGATCTGGGATTTTTG,AATTCAAAAATCCCAGATCATATACTCCTATCTCGAGATAGGAGTATATGATCTGGGA,n/a
human,127018,LYPLAL1,XR_001736964.2,TRCN0000076870,NM_146106.1-205s1c1,GACTTAACATTCCAGCACATA,pLKO.1,155,3UTR,90,89,,,Y,226791,Lyplal1,CCGGGACTTAACATTCCAGCACATACTCGAGTATGTGCTGGAATGTTAAGTCTTTTTG,AATTCAAAAAGACTTAACATTCCAGCACATACTCGAGTATGTGCTGGAATGTTAAGTC,n/a
human,127018,LYPLAL1,XR_001736964.2,TRCN0000165534,NM_001012717.1-362s1c1,GAGACAGGGTTTCACCATGTT,pLKO.1,1830,3UTR,90,89,,,Y,,,CCGGGAGACAGGGTTTCACCATGTTCTCGAGAACATGGTGAAACCCTGTCTCTTTTTG,AATTCAAAAAGAGACAGGGTTTCACCATGTTCTCGAGAACATGGTGAAACCCTGTCTC,n/a
human,127018,LYPLAL1,XR_001736964.2,TRCN0000101659,NM_015750.1-344s1c1,GTCCCTTGTATGACAAGCAAA,pLKO.1,1762,3UTR,90,89,,,Y,23956,Neu2,CCGGGTCCCTTGTATGACAAGCAAACTCGAGTTTGCTTGTCATACAAGGGACTTTTTG,AATTCAAAAAGTCCCTTGTATGACAAGCAAACTCGAGTTTGCTTGTCATACAAGGGAC,n/a
human,127018,LYPLAL1,XR_001736964.2,TRCN0000116235,NM_020879.1-628s1c1,GCCAGGAGAAATGGAGAAGAA,pLKO.1,727,3UTR,85,89,,,Y,57639,CCDC146,CCGGGCCAGGAGAAATGGAGAAGAACTCGAGTTCTTCTCCATTTCTCCTGGCTTTTTG,AATTCAAAAAGCCAGGAGAAATGGAGAAGAACTCGAGTTCTTCTCCATTTCTCCTGGC,n/a
human,127018,LYPLAL1,XR_001736964.2,TRCN0000379894,NM_024011.2-510s21c1,ACATCGAGAAGAACAGGATAA,pLKO_005,375,3UTR,85,89,,,Y,728642,CDK11A,CCGGACATCGAGAAGAACAGGATAACTCGAGTTATCCTGTTCTTCTCGATGTTTTTTG,AATTCAAAAAACATCGAGAAGAACAGGATAACTCGAGTTATCCTGTTCTTCTCGATGT,n/a
human,127018,LYPLAL1,XR_001736964.2,TRCN0000053946,NM_153214.1-1272s1c1,CCAAGACCATCTCCTTCCATT,pLKO.1,820,3UTR,85,89,,,Y,129804,FBLN7,CCGGCCAAGACCATCTCCTTCCATTCTCGAGAATGGAAGGAGATGGTCTTGGTTTTTG,AATTCAAAAACCAAGACCATCTCCTTCCATTCTCGAGAATGGAAGGAGATGGTCTTGG,n/a
human,127018,LYPLAL1,XR_001736964.2,TRCN0000104200,NM_023372.1-189s1c1,GATCAAGAAGAACAAGGATAA,pLKO.1,376,3UTR,85,89,,,Y,67671,Rpl38,CCGGGATCAAGAAGAACAAGGATAACTCGAGTTATCCTTGTTCTTCTTGATCTTTTTG,AATTCAAAAAGATCAAGAAGAACAAGGATAACTCGAGTTATCCTTGTTCTTCTTGATC,n/a
human,127018,LYPLAL1,XR_001736964.2,TRCN0000127631,NM_012478.2-1713s1c1,CCATGAAGTGAGGAGATGGTT,pLKO.1,1152,3UTR,80,89,,,Y,23558,WBP2,CCGGCCATGAAGTGAGGAGATGGTTCTCGAGAACCATCTCCTCACTTCATGGTTTTTG,AATTCAAAAACCATGAAGTGAGGAGATGGTTCTCGAGAACCATCTCCTCACTTCATGG,n/a
human,127018,LYPLAL1,XR_001736964.2,TRCN0000331002,NM_012478.3-1800s21c1,CCATGAAGTGAGGAGATGGTT,pLKO_005,1152,3UTR,80,89,,,Y,23558,WBP2,CCGGCCATGAAGTGAGGAGATGGTTCTCGAGAACCATCTCCTCACTTCATGGTTTTTG,AATTCAAAAACCATGAAGTGAGGAGATGGTTCTCGAGAACCATCTCCTCACTTCATGG,n/a
human,127018,LYPLAL1,XR_001736964.2,TRCN0000426690,NM_001139.2-345s21c1,GACACAAGGAGAGAGCCATAA,pLKO_005,1044,3UTR,80,89,,,Y,242,ALOX12B,CCGGGACACAAGGAGAGAGCCATAACTCGAGTTATGGCTCTCTCCTTGTGTCTTTTTG,AATTCAAAAAGACACAAGGAGAGAGCCATAACTCGAGTTATGGCTCTCTCCTTGTGTC,n/a
human,127018,LYPLAL1,XR_001736964.2,TRCN0000202709,XM_485028.1-64s1c1,CTTTGGCAGAATAGACAAATA,pLKO.1,594,3UTR,80,89,,,Y,433449,Olfr1197,CCGGCTTTGGCAGAATAGACAAATACTCGAGTATTTGTCTATTCTGCCAAAGTTTTTG,AATTCAAAAACTTTGGCAGAATAGACAAATACTCGAGTATTTGTCTATTCTGCCAAAG,n/a
human,127018,LYPLAL1,XR_001736964.2,TRCN0000101657,NM_015750.1-347s1c1,CCTTGTATGACAAGCAAACAA,pLKO.1,1765,3UTR,80,89,,,Y,23956,Neu2,CCGGCCTTGTATGACAAGCAAACAACTCGAGTTGTTTGCTTGTCATACAAGGTTTTTG,AATTCAAAAACCTTGTATGACAAGCAAACAACTCGAGTTGTTTGCTTGTCATACAAGG,n/a
human,127018,LYPLAL1,XR_001736964.2,TRCN0000188507,NM_146513.1-480s1c1,CTTCATCTTCTCCTTGCCCTT,pLKO.1,1355,3UTR,80,89,,,Y,258506,Olfr95,CCGGCTTCATCTTCTCCTTGCCCTTCTCGAGAAGGGCAAGGAGAAGATGAAGTTTTTG,AATTCAAAAACTTCATCTTCTCCTTGCCCTTCTCGAGAAGGGCAAGGAGAAGATGAAG,n/a
human,127018,LYPLAL1,XR_001736964.2,TRCN0000252571,NM_001109914.1-347s21c1,CTCTCTGATCTTCTGCAATTC,pLKO_005,79,3UTR,81,85,,,Y,381823,Apold1,CCGGCTCTCTGATCTTCTGCAATTCCTCGAGGAATTGCAGAAGATCAGAGAGTTTTTG,AATTCAAAAACTCTCTGATCTTCTGCAATTCCTCGAGGAATTGCAGAAGATCAGAGAG,n/a
human,127018,LYPLAL1,XR_001736964.2,TRCN0000035279,NM_001056.3-2441s1c1,GCAGACAATAAGAGGAAGAAT,pLKO.1,1469,3UTR,81,85,,,Y,6819,SULT1C2,CCGGGCAGACAATAAGAGGAAGAATCTCGAGATTCTTCCTCTTATTGTCTGCTTTTTG,AATTCAAAAAGCAGACAATAAGAGGAAGAATCTCGAGATTCTTCCTCTTATTGTCTGC,n/a
human,127018,LYPLAL1,XR_001736964.2,TRCN0000001616,NM_005465.x-200s1c1,AGAAACCTCAAGATGTGGATT,pLKO.1,446,3UTR,77,85,,,Y,10000,AKT3,CCGGAGAAACCTCAAGATGTGGATTCTCGAGAATCCACATCTTGAGGTTTCTTTTTTG,AATTCAAAAAAGAAACCTCAAGATGTGGATTCTCGAGAATCCACATCTTGAGGTTTCT,n/a
