Taxon,"Gene ID","Gene Symbol",Transcript,"Clone ID","Legacy Clone Name","Target Seq",Vector,"Match Position","Match Region","Match %","SDR Match %","Intrinsic Score","Adjusted Score","Matches Other Gene in Same Taxon?","Orig. Target Gene ID","Orig. Target Gene Symbol","Forward Oligo Sequence","Reverse Oligo Sequence",Addgene
human,9617,MTRF1,XM_017020859.2,TRCN0000232959,NM_004294.2-996s21c1,GATTTGCGAATAGATACATTT,pLKO_005,1306,CDS,100,100,13.2,18.48,N,9617,MTRF1,CCGGGATTTGCGAATAGATACATTTCTCGAGAAATGTATCTATTCGCAAATCTTTTTG,AATTCAAAAAGATTTGCGAATAGATACATTTCTCGAGAAATGTATCTATTCGCAAATC,n/a
human,9617,MTRF1,XM_017020859.2,TRCN0000154320,NM_004294.2-786s1c1,CCAGCAGATTATGGTGGACTA,pLKO.1,1096,CDS,100,100,4.05,5.67,N,9617,MTRF1,CCGGCCAGCAGATTATGGTGGACTACTCGAGTAGTCCACCATAATCTGCTGGTTTTTG,AATTCAAAAACCAGCAGATTATGGTGGACTACTCGAGTAGTCCACCATAATCTGCTGG,n/a
human,9617,MTRF1,XM_017020859.2,TRCN0000155034,NM_004294.2-1161s1c1,GCTAGACTCTACCAGCAGATT,pLKO.1,1471,CDS,100,100,4.95,3.96,N,9617,MTRF1,CCGGGCTAGACTCTACCAGCAGATTCTCGAGAATCTGCTGGTAGAGTCTAGCTTTTTG,AATTCAAAAAGCTAGACTCTACCAGCAGATTCTCGAGAATCTGCTGGTAGAGTCTAGC,n/a
human,9617,MTRF1,XM_017020859.2,TRCN0000232958,NM_004294.2-735s21c1,CAGAATTATTCGTGCTATAAA,pLKO_005,1045,CDS,100,100,15,10.5,N,9617,MTRF1,CCGGCAGAATTATTCGTGCTATAAACTCGAGTTTATAGCACGAATAATTCTGTTTTTG,AATTCAAAAACAGAATTATTCGTGCTATAAACTCGAGTTTATAGCACGAATAATTCTG,n/a
human,9617,MTRF1,XM_017020859.2,TRCN0000232957,NM_004294.2-701s21c1,CCAACAATTTACCCGAGAAAT,pLKO_005,1011,CDS,100,100,13.2,9.24,N,9617,MTRF1,CCGGCCAACAATTTACCCGAGAAATCTCGAGATTTCTCGGGTAAATTGTTGGTTTTTG,AATTCAAAAACCAACAATTTACCCGAGAAATCTCGAGATTTCTCGGGTAAATTGTTGG,n/a
human,9617,MTRF1,XM_017020859.2,TRCN0000152306,NM_004294.2-1106s1c1,CCAACAAGAAAGATCACAGAT,pLKO.1,1416,CDS,100,100,4.95,3.465,N,9617,MTRF1,CCGGCCAACAAGAAAGATCACAGATCTCGAGATCTGTGATCTTTCTTGTTGGTTTTTG,AATTCAAAAACCAACAAGAAAGATCACAGATCTCGAGATCTGTGATCTTTCTTGTTGG,n/a
human,9617,MTRF1,XM_017020859.2,TRCN0000154737,NM_004294.2-922s1c1,GCATTCACACAGGAACGATGT,pLKO.1,1232,CDS,100,100,4.05,2.835,N,9617,MTRF1,CCGGGCATTCACACAGGAACGATGTCTCGAGACATCGTTCCTGTGTGAATGCTTTTTG,AATTCAAAAAGCATTCACACAGGAACGATGTCTCGAGACATCGTTCCTGTGTGAATGC,n/a
human,9617,MTRF1,XM_017020859.2,TRCN0000257053,NM_004294.2-826s21c1,TTTCCGGTGACGGTGTCTATA,pLKO_005,1136,CDS,100,100,13.2,7.92,N,9617,MTRF1,CCGGTTTCCGGTGACGGTGTCTATACTCGAGTATAGACACCGTCACCGGAAATTTTTG,AATTCAAAAATTTCCGGTGACGGTGTCTATACTCGAGTATAGACACCGTCACCGGAAA,n/a
human,9617,MTRF1,XM_017020859.2,TRCN0000191857,NM_145960.2-764s1c1,GAACAAGCCATTGAAGAATTA,pLKO.1,790,CDS,95,95,,,Y,211253,Mtrf1,CCGGGAACAAGCCATTGAAGAATTACTCGAGTAATTCTTCAATGGCTTGTTCTTTTTG,AATTCAAAAAGAACAAGCCATTGAAGAATTACTCGAGTAATTCTTCAATGGCTTGTTC,n/a
human,9617,MTRF1,XM_017020859.2,TRCN0000000654,NM_003583.x-478s1c1,CTGAACAAGCAATGAAGCAAT,pLKO.1,788,CDS,86,90,,,Y,8445,DYRK2,CCGGCTGAACAAGCAATGAAGCAATCTCGAGATTGCTTCATTGCTTGTTCAGTTTTTG,AATTCAAAAACTGAACAAGCAATGAAGCAATCTCGAGATTGCTTCATTGCTTGTTCAG,n/a
human,9617,MTRF1,XM_017020859.2,TRCN0000200636,NM_145960.2-1587s1c1,CGTATGAAGTTCGTGACATTA,pLKO.1,1613,CDS,90,89,,,N,211253,Mtrf1,CCGGCGTATGAAGTTCGTGACATTACTCGAGTAATGTCACGAACTTCATACGTTTTTG,AATTCAAAAACGTATGAAGTTCGTGACATTACTCGAGTAATGTCACGAACTTCATACG,n/a
human,9617,MTRF1,XM_017020859.2,TRCN0000248452,NM_145960.3-1586s21c1,CGTATGAAGTTCGTGACATTA,pLKO_005,1613,CDS,90,89,,,N,211253,Mtrf1,CCGGCGTATGAAGTTCGTGACATTACTCGAGTAATGTCACGAACTTCATACGTTTTTG,AATTCAAAAACGTATGAAGTTCGTGACATTACTCGAGTAATGTCACGAACTTCATACG,n/a
human,9617,MTRF1,XM_017020859.2,TRCN0000140610,NM_025042.2-931s1c1,GCCTCTCAGGTTCAAGCAATT,pLKO.1,347,CDS,90,89,,,Y,,,CCGGGCCTCTCAGGTTCAAGCAATTCTCGAGAATTGCTTGAACCTGAGAGGCTTTTTG,AATTCAAAAAGCCTCTCAGGTTCAAGCAATTCTCGAGAATTGCTTGAACCTGAGAGGC,n/a
human,9617,MTRF1,XM_017020859.2,TRCN0000248449,NM_145960.3-985s21c1,CAACAGTTTACCCGGGAAATA,pLKO_005,1012,CDS,90,89,,,Y,211253,Mtrf1,CCGGCAACAGTTTACCCGGGAAATACTCGAGTATTTCCCGGGTAAACTGTTGTTTTTG,AATTCAAAAACAACAGTTTACCCGGGAAATACTCGAGTATTTCCCGGGTAAACTGTTG,n/a
human,9617,MTRF1,XM_017020859.2,TRCN0000022430,NM_024787.2-558s1c1,CCTTATCTTCTGCTGCTATTT,pLKO.1,1854,3UTR,85,89,,,Y,79845,RNF122,CCGGCCTTATCTTCTGCTGCTATTTCTCGAGAAATAGCAGCAGAAGATAAGGTTTTTG,AATTCAAAAACCTTATCTTCTGCTGCTATTTCTCGAGAAATAGCAGCAGAAGATAAGG,n/a
human,9617,MTRF1,XM_017020859.2,TRCN0000017819,NM_033213.1-886s1c1,GCCAACATGAAAGATCTCATA,pLKO.1,1415,CDS,85,89,,,Y,93474,ZNF670,CCGGGCCAACATGAAAGATCTCATACTCGAGTATGAGATCTTTCATGTTGGCTTTTTG,AATTCAAAAAGCCAACATGAAAGATCTCATACTCGAGTATGAGATCTTTCATGTTGGC,n/a
human,9617,MTRF1,XM_017020859.2,TRCN0000073968,NM_024332.1-204s1c1,GCCGTCAGAATTGTTCACATT,pLKO.1,1372,CDS,85,89,,,Y,79184,BRCC3,CCGGGCCGTCAGAATTGTTCACATTCTCGAGAATGTGAACAATTCTGACGGCTTTTTG,AATTCAAAAAGCCGTCAGAATTGTTCACATTCTCGAGAATGTGAACAATTCTGACGGC,n/a
human,9617,MTRF1,XM_017020859.2,TRCN0000181182,NM_145272.2-455s1c1,CAAGAAATGCAGGAGTCTGCA,pLKO.1,772,CDS,85,89,,,Y,146853,C17orf50,CCGGCAAGAAATGCAGGAGTCTGCACTCGAGTGCAGACTCCTGCATTTCTTGTTTTTG,AATTCAAAAACAAGAAATGCAGGAGTCTGCACTCGAGTGCAGACTCCTGCATTTCTTG,n/a
human,9617,MTRF1,XM_017020859.2,TRCN0000356361,NM_005303.2-563s21c1,AGCCTCTCTCTCCTGCTCTTT,pLKO_005,1852,3UTR,85,89,,,Y,2864,FFAR1,CCGGAGCCTCTCTCTCCTGCTCTTTCTCGAGAAAGAGCAGGAGAGAGAGGCTTTTTTG,AATTCAAAAAAGCCTCTCTCTCCTGCTCTTTCTCGAGAAAGAGCAGGAGAGAGAGGCT,n/a
human,9617,MTRF1,XM_017020859.2,TRCN0000337418,NM_001114403.1-1038s21c1,CCTCACGGGTTCAAGCGATTT,pLKO_005,348,CDS,85,89,,,Y,100134938,UPK3BL1,CCGGCCTCACGGGTTCAAGCGATTTCTCGAGAAATCGCTTGAACCCGTGAGGTTTTTG,AATTCAAAAACCTCACGGGTTCAAGCGATTTCTCGAGAAATCGCTTGAACCCGTGAGG,n/a
human,9617,MTRF1,XM_017020859.2,TRCN0000181813,NM_011676.2-661s1c1,GAGATGATTCGTCACCCGTAT,pLKO.1,409,CDS,85,89,,,Y,22248,Unc119,CCGGGAGATGATTCGTCACCCGTATCTCGAGATACGGGTGACGAATCATCTCTTTTTG,AATTCAAAAAGAGATGATTCGTCACCCGTATCTCGAGATACGGGTGACGAATCATCTC,n/a
human,9617,MTRF1,XM_017020859.2,TRCN0000320301,NM_011676.2-661s21c1,GAGATGATTCGTCACCCGTAT,pLKO_005,409,CDS,85,89,,,Y,22248,Unc119,CCGGGAGATGATTCGTCACCCGTATCTCGAGATACGGGTGACGAATCATCTCTTTTTG,AATTCAAAAAGAGATGATTCGTCACCCGTATCTCGAGATACGGGTGACGAATCATCTC,n/a
human,9617,MTRF1,XM_017020859.2,TRCN0000079838,NM_009320.3-2774s1c1,GCCAACAAGAAAGATGCCAAA,pLKO.1,1415,CDS,85,89,,,Y,21366,Slc6a6,CCGGGCCAACAAGAAAGATGCCAAACTCGAGTTTGGCATCTTTCTTGTTGGCTTTTTG,AATTCAAAAAGCCAACAAGAAAGATGCCAAACTCGAGTTTGGCATCTTTCTTGTTGGC,n/a
human,9617,MTRF1,XM_017020859.2,TRCN0000141125,NM_153233.1-1432s1c1,CAGGTTCAAGAGATTCTCCTA,pLKO.1,353,CDS,85,89,,,Y,163183,SYNE4,CCGGCAGGTTCAAGAGATTCTCCTACTCGAGTAGGAGAATCTCTTGAACCTGTTTTTG,AATTCAAAAACAGGTTCAAGAGATTCTCCTACTCGAGTAGGAGAATCTCTTGAACCTG,n/a
human,9617,MTRF1,XM_017020859.2,TRCN0000130146,NM_207443.1-652s1c1,CAGGTTCAAGTGATTCTCCTA,pLKO.1,353,CDS,85,89,,,Y,400242,DICER1-AS1,CCGGCAGGTTCAAGTGATTCTCCTACTCGAGTAGGAGAATCACTTGAACCTGTTTTTG,AATTCAAAAACAGGTTCAAGTGATTCTCCTACTCGAGTAGGAGAATCACTTGAACCTG,n/a
human,9617,MTRF1,XM_017020859.2,TRCN0000185144,NM_146992.1-566s1c1,CAGATCCATCTCTTAATGGAT,pLKO.1,443,CDS,85,89,,,Y,258994,Olfr204,CCGGCAGATCCATCTCTTAATGGATCTCGAGATCCATTAAGAGATGGATCTGTTTTTG,AATTCAAAAACAGATCCATCTCTTAATGGATCTCGAGATCCATTAAGAGATGGATCTG,n/a
human,9617,MTRF1,XM_017020859.2,TRCN0000156215,NM_052948.2-3350s1c1,CGAGGGTCCTTGTACAGAAAT,pLKO.1,718,CDS,80,89,,,Y,115703,ARHGAP33,CCGGCGAGGGTCCTTGTACAGAAATCTCGAGATTTCTGTACAAGGACCCTCGTTTTTG,AATTCAAAAACGAGGGTCCTTGTACAGAAATCTCGAGATTTCTGTACAAGGACCCTCG,n/a
human,9617,MTRF1,XM_017020859.2,TRCN0000151230,NM_016356.1-1980s1c1,GAATTTGCACTGGAAGACAAT,pLKO.1,859,CDS,80,89,,,Y,51473,DCDC2,CCGGGAATTTGCACTGGAAGACAATCTCGAGATTGTCTTCCAGTGCAAATTCTTTTTG,AATTCAAAAAGAATTTGCACTGGAAGACAATCTCGAGATTGTCTTCCAGTGCAAATTC,n/a
human,9617,MTRF1,XM_017020859.2,TRCN0000032689,NM_175939.2-1926s1c1,CCAATATGAAAGATCACAGTA,pLKO.1,1416,CDS,80,89,,,Y,244486,Adam29,CCGGCCAATATGAAAGATCACAGTACTCGAGTACTGTGATCTTTCATATTGGTTTTTG,AATTCAAAAACCAATATGAAAGATCACAGTACTCGAGTACTGTGATCTTTCATATTGG,n/a
human,9617,MTRF1,XM_017020859.2,TRCN0000010487,NM_015247.x-3218s1c1,TATATGTGCATGTACCAGAGT,pLKO.1,1029,CDS,81,85,,,Y,1540,CYLD,CCGGTATATGTGCATGTACCAGAGTCTCGAGACTCTGGTACATGCACATATATTTTTG,AATTCAAAAATATATGTGCATGTACCAGAGTCTCGAGACTCTGGTACATGCACATATA,n/a
human,9617,MTRF1,XM_017020859.2,TRCN0000073143,NM_032850.3-1576s1c1,GTCCCTGGAATGAGGAAAGAT,pLKO.1,697,CDS,77,85,,,Y,84936,ZFYVE19,CCGGGTCCCTGGAATGAGGAAAGATCTCGAGATCTTTCCTCATTCCAGGGACTTTTTG,AATTCAAAAAGTCCCTGGAATGAGGAAAGATCTCGAGATCTTTCCTCATTCCAGGGAC,n/a
