Taxon,"Gene ID","Gene Symbol",Transcript,"Clone ID","Legacy Clone Name","Target Seq",Vector,"Match Position","Match Region","Match %","SDR Match %","Intrinsic Score","Adjusted Score","Matches Other Gene in Same Taxon?","Orig. Target Gene ID","Orig. Target Gene Symbol","Forward Oligo Sequence","Reverse Oligo Sequence",Addgene
human,196951,FAM227B,XM_011521325.3,TRCN0000135434,NM_152647.1-1073s1c1,GCAACGTTCCATGAAGCATTT,pLKO.1,1152,CDS,100,100,10.8,15.12,N,196951,FAM227B,CCGGGCAACGTTCCATGAAGCATTTCTCGAGAAATGCTTCATGGAACGTTGCTTTTTG,AATTCAAAAAGCAACGTTCCATGAAGCATTTCTCGAGAAATGCTTCATGGAACGTTGC,n/a
human,196951,FAM227B,XM_011521325.3,TRCN0000135316,NM_152647.1-356s1c1,CCTCCAAAGAGCATTGAAGAA,pLKO.1,435,CDS,100,100,4.95,3.465,N,196951,FAM227B,CCGGCCTCCAAAGAGCATTGAAGAACTCGAGTTCTTCAATGCTCTTTGGAGGTTTTTG,AATTCAAAAACCTCCAAAGAGCATTGAAGAACTCGAGTTCTTCAATGCTCTTTGGAGG,n/a
human,196951,FAM227B,XM_011521325.3,TRCN0000296862,NM_015361.2-1114s21c1,AGACTTTCAGAAACGTTATAT,pLKO_005,1050,CDS,85,89,,,Y,23518,R3HDM1,CCGGAGACTTTCAGAAACGTTATATCTCGAGATATAACGTTTCTGAAAGTCTTTTTTG,AATTCAAAAAAGACTTTCAGAAACGTTATATCTCGAGATATAACGTTTCTGAAAGTCT,n/a
human,196951,FAM227B,XM_011521325.3,TRCN0000262182,NM_173511.2-1010s21c1,TTGTTGATCCCAGAGATAAAG,pLKO_005,246,5UTR,80,89,,,Y,150864,FAM117B,CCGGTTGTTGATCCCAGAGATAAAGCTCGAGCTTTATCTCTGGGATCAACAATTTTTG,AATTCAAAAATTGTTGATCCCAGAGATAAAGCTCGAGCTTTATCTCTGGGATCAACAA,n/a
human,196951,FAM227B,XM_011521325.3,TRCN0000002802,NM_006247.x-757s1c1,GAGACAGAGAAGATTACAGTA,pLKO.1,792,CDS,80,89,,,Y,5536,PPP5C,CCGGGAGACAGAGAAGATTACAGTACTCGAGTACTGTAATCTTCTCTGTCTCTTTTTG,AATTCAAAAAGAGACAGAGAAGATTACAGTACTCGAGTACTGTAATCTTCTCTGTCTC,n/a
human,196951,FAM227B,XM_011521325.3,TRCN0000048477,NM_024605.2-581s1c1,GCCAGAGAAGAATAAAGAGAT,pLKO.1,794,CDS,80,89,,,Y,79658,ARHGAP10,CCGGGCCAGAGAAGAATAAAGAGATCTCGAGATCTCTTTATTCTTCTCTGGCTTTTTG,AATTCAAAAAGCCAGAGAAGAATAAAGAGATCTCGAGATCTCTTTATTCTTCTCTGGC,n/a
human,196951,FAM227B,XM_011521325.3,TRCN0000112363,NM_054069.1-213s1c1,GATGAGCAATGGAGACAGATT,pLKO.1,783,CDS,80,89,,,Y,114895,Psbpc1,CCGGGATGAGCAATGGAGACAGATTCTCGAGAATCTGTCTCCATTGCTCATCTTTTTG,AATTCAAAAAGATGAGCAATGGAGACAGATTCTCGAGAATCTGTCTCCATTGCTCATC,n/a
human,196951,FAM227B,XM_011521325.3,TRCN0000176218,NM_001025084.1-654s1c1,GAGAAGAGCAGAATATAGGAA,pLKO.1,792,CDS,77,85,,,Y,385343,Rhox1,CCGGGAGAAGAGCAGAATATAGGAACTCGAGTTCCTATATTCTGCTCTTCTCTTTTTG,AATTCAAAAAGAGAAGAGCAGAATATAGGAACTCGAGTTCCTATATTCTGCTCTTCTC,n/a
human,196951,FAM227B,XM_011521325.3,TRCN0000174504,NM_016871.1-1168s1c1,CTCAGAAAGGAAAGACTTGAT,pLKO.1,1337,CDS,77,85,,,Y,53333,Tomm40,CCGGCTCAGAAAGGAAAGACTTGATCTCGAGATCAAGTCTTTCCTTTCTGAGTTTTTG,AATTCAAAAACTCAGAAAGGAAAGACTTGATCTCGAGATCAAGTCTTTCCTTTCTGAG,n/a
human,196951,FAM227B,XM_011521325.3,TRCN0000279346,NM_016871.2-1392s21c1,CTCAGAAAGGAAAGACTTGAT,pLKO_005,1337,CDS,77,85,,,Y,53333,Tomm40,CCGGCTCAGAAAGGAAAGACTTGATCTCGAGATCAAGTCTTTCCTTTCTGAGTTTTTG,AATTCAAAAACTCAGAAAGGAAAGACTTGATCTCGAGATCAAGTCTTTCCTTTCTGAG,n/a
human,196951,FAM227B,XM_011521325.3,TRCN0000116412,NM_015848.1-2258s1c1,CTCCCATTCTTACTGGGAGTT,pLKO.1,161,5UTR,77,85,,,Y,51350,KRT76,CCGGCTCCCATTCTTACTGGGAGTTCTCGAGAACTCCCAGTAAGAATGGGAGTTTTTG,AATTCAAAAACTCCCATTCTTACTGGGAGTTCTCGAGAACTCCCAGTAAGAATGGGAG,n/a
