Taxon,"Gene ID","Gene Symbol",Transcript,"Clone ID","Legacy Clone Name","Target Seq",Vector,"Match Position","Match Region","Match %","SDR Match %","Intrinsic Score","Adjusted Score","Matches Other Gene in Same Taxon?","Orig. Target Gene ID","Orig. Target Gene Symbol","Forward Oligo Sequence","Reverse Oligo Sequence",Addgene
human,196951,FAM227B,XM_024449864.1,TRCN0000135434,NM_152647.1-1073s1c1,GCAACGTTCCATGAAGCATTT,pLKO.1,944,CDS,100,100,10.8,15.12,N,196951,FAM227B,CCGGGCAACGTTCCATGAAGCATTTCTCGAGAAATGCTTCATGGAACGTTGCTTTTTG,AATTCAAAAAGCAACGTTCCATGAAGCATTTCTCGAGAAATGCTTCATGGAACGTTGC,n/a
human,196951,FAM227B,XM_024449864.1,TRCN0000135316,NM_152647.1-356s1c1,CCTCCAAAGAGCATTGAAGAA,pLKO.1,368,CDS,100,100,4.95,3.465,N,196951,FAM227B,CCGGCCTCCAAAGAGCATTGAAGAACTCGAGTTCTTCAATGCTCTTTGGAGGTTTTTG,AATTCAAAAACCTCCAAAGAGCATTGAAGAACTCGAGTTCTTCAATGCTCTTTGGAGG,n/a
human,196951,FAM227B,XM_024449864.1,TRCN0000296862,NM_015361.2-1114s21c1,AGACTTTCAGAAACGTTATAT,pLKO_005,842,CDS,85,89,,,Y,23518,R3HDM1,CCGGAGACTTTCAGAAACGTTATATCTCGAGATATAACGTTTCTGAAAGTCTTTTTTG,AATTCAAAAAAGACTTTCAGAAACGTTATATCTCGAGATATAACGTTTCTGAAAGTCT,n/a
human,196951,FAM227B,XM_024449864.1,TRCN0000087367,XM_487612.1-84s1c1,CCAGATTATGGCAGATGACTT,pLKO.1,1310,3UTR,85,89,,,Y,435637,LOC435637,CCGGCCAGATTATGGCAGATGACTTCTCGAGAAGTCATCTGCCATAATCTGGTTTTTG,AATTCAAAAACCAGATTATGGCAGATGACTTCTCGAGAAGTCATCTGCCATAATCTGG,n/a
human,196951,FAM227B,XM_024449864.1,TRCN0000436023,NM_173462.3-4151s21c1,GTTACACAGGAATAGTTAAAT,pLKO_005,1820,3UTR,85,89,,,Y,89932,PAPLN,CCGGGTTACACAGGAATAGTTAAATCTCGAGATTTAACTATTCCTGTGTAACTTTTTG,AATTCAAAAAGTTACACAGGAATAGTTAAATCTCGAGATTTAACTATTCCTGTGTAAC,n/a
human,196951,FAM227B,XM_024449864.1,TRCN0000022901,NM_009071.1-108s1c1,CCTGGTTTATGATTTGGATTT,pLKO.1,1338,3UTR,80,89,,,N,19877,Rock1,CCGGCCTGGTTTATGATTTGGATTTCTCGAGAAATCCAAATCATAAACCAGGTTTTTG,AATTCAAAAACCTGGTTTATGATTTGGATTTCTCGAGAAATCCAAATCATAAACCAGG,n/a
human,196951,FAM227B,XM_024449864.1,TRCN0000167679,NM_024077.2-1186s1c1,GCCTCAAGAAAGAATAAGAAA,pLKO.1,1194,CDS,81,85,,,Y,79048,SECISBP2,CCGGGCCTCAAGAAAGAATAAGAAACTCGAGTTTCTTATTCTTTCTTGAGGCTTTTTG,AATTCAAAAAGCCTCAAGAAAGAATAAGAAACTCGAGTTTCTTATTCTTTCTTGAGGC,n/a
human,196951,FAM227B,XM_024449864.1,TRCN0000116412,NM_015848.1-2258s1c1,CTCCCATTCTTACTGGGAGTT,pLKO.1,163,5UTR,77,85,,,Y,51350,KRT76,CCGGCTCCCATTCTTACTGGGAGTTCTCGAGAACTCCCAGTAAGAATGGGAGTTTTTG,AATTCAAAAACTCCCATTCTTACTGGGAGTTCTCGAGAACTCCCAGTAAGAATGGGAG,n/a
human,196951,FAM227B,XM_024449864.1,TRCN0000020992,NM_032203.3-1304s1c1,CCCTGAAATTGGCTTCCAGAA,pLKO.1,1363,3UTR,77,85,,,Y,84163,GTF2IRD2,CCGGCCCTGAAATTGGCTTCCAGAACTCGAGTTCTGGAAGCCAATTTCAGGGTTTTTG,AATTCAAAAACCCTGAAATTGGCTTCCAGAACTCGAGTTCTGGAAGCCAATTTCAGGG,n/a
