Taxon,"Gene ID","Gene Symbol",Transcript,"Clone ID","Legacy Clone Name","Target Seq",Vector,"Match Position","Match Region","Match %","SDR Match %","Intrinsic Score","Adjusted Score","Matches Other Gene in Same Taxon?","Orig. Target Gene ID","Orig. Target Gene Symbol","Forward Oligo Sequence","Reverse Oligo Sequence",Addgene
human,112267959,LOC112267959,XM_024446606.1,TRCN0000078633,NM_032214.2-1896s1c1,CCTCCAGAATAGCTGGGATTA,pLKO.1,92,CDS,90,89,,,Y,84174,SLA2,CCGGCCTCCAGAATAGCTGGGATTACTCGAGTAATCCCAGCTATTCTGGAGGTTTTTG,AATTCAAAAACCTCCAGAATAGCTGGGATTACTCGAGTAATCCCAGCTATTCTGGAGG,n/a
human,112267959,LOC112267959,XM_024446606.1,TRCN0000430981,NM_173537.2-3266s21c1,GCCACCATGCCTGGCTAATTT,pLKO_005,122,CDS,90,89,,,Y,84163,GTF2IRD2,CCGGGCCACCATGCCTGGCTAATTTCTCGAGAAATTAGCCAGGCATGGTGGCTTTTTG,AATTCAAAAAGCCACCATGCCTGGCTAATTTCTCGAGAAATTAGCCAGGCATGGTGGC,n/a
human,112267959,LOC112267959,XM_024446606.1,TRCN0000165534,NM_001012717.1-362s1c1,GAGACAGGGTTTCACCATGTT,pLKO.1,163,CDS,90,89,,,Y,,,CCGGGAGACAGGGTTTCACCATGTTCTCGAGAACATGGTGAAACCCTGTCTCTTTTTG,AATTCAAAAAGAGACAGGGTTTCACCATGTTCTCGAGAACATGGTGAAACCCTGTCTC,n/a
human,112267959,LOC112267959,XM_024446606.1,TRCN0000093905,NM_010283.1-1456s1c1,CCAGAGTATTGCTGGGACTAT,pLKO.1,95,CDS,85,89,,,Y,14594,Ggta1,CCGGCCAGAGTATTGCTGGGACTATCTCGAGATAGTCCCAGCAATACTCTGGTTTTTG,AATTCAAAAACCAGAGTATTGCTGGGACTATCTCGAGATAGTCCCAGCAATACTCTGG,n/a
human,112267959,LOC112267959,XM_024446606.1,TRCN0000157610,NM_024565.4-569s1c1,GTGGCATGATCTCAGCTCATT,pLKO.1,29,CDS,85,89,,,Y,79616,CCNJL,CCGGGTGGCATGATCTCAGCTCATTCTCGAGAATGAGCTGAGATCATGCCACTTTTTG,AATTCAAAAAGTGGCATGATCTCAGCTCATTCTCGAGAATGAGCTGAGATCATGCCAC,n/a
human,112267959,LOC112267959,XM_024446606.1,TRCN0000264189,NM_001085490.1-613s21c1,CAAGTAGCTGGGACTACAGGA,pLKO_005,97,CDS,85,89,,,Y,285501,LINC01098,CCGGCAAGTAGCTGGGACTACAGGACTCGAGTCCTGTAGTCCCAGCTACTTGTTTTTG,AATTCAAAAACAAGTAGCTGGGACTACAGGACTCGAGTCCTGTAGTCCCAGCTACTTG,n/a
human,112267959,LOC112267959,XM_024446606.1,TRCN0000040158,NM_017489.1-1753s1c1,GCGCAATTTCAGCTCACTGAA,pLKO.1,32,CDS,85,89,,,Y,7013,TERF1,CCGGGCGCAATTTCAGCTCACTGAACTCGAGTTCAGTGAGCTGAAATTGCGCTTTTTG,AATTCAAAAAGCGCAATTTCAGCTCACTGAACTCGAGTTCAGTGAGCTGAAATTGCGC,n/a
human,112267959,LOC112267959,XM_024446606.1,TRCN0000232390,NM_020009.1-8173s21c1,CTGGATGCAGTGGCGACATTT,pLKO_005,19,CDS,81,85,,,Y,56717,Mtor,CCGGCTGGATGCAGTGGCGACATTTCTCGAGAAATGTCGCCACTGCATCCAGTTTTTG,AATTCAAAAACTGGATGCAGTGGCGACATTTCTCGAGAAATGTCGCCACTGCATCCAG,n/a
