Taxon,"Gene ID","Gene Symbol",Transcript,"Clone ID","Legacy Clone Name","Target Seq",Vector,"Match Position","Match Region","Match %","SDR Match %","Intrinsic Score","Adjusted Score","Matches Other Gene in Same Taxon?","Orig. Target Gene ID","Orig. Target Gene Symbol","Forward Oligo Sequence","Reverse Oligo Sequence",Addgene
human,3903,LAIR1,XM_017026803.2,TRCN0000425722,NM_002287.3-530s21c1,GTGTCTCAAGCTAGTCCATCT,pLKO_005,347,CDS,100,100,4.05,3.24,N,3903,LAIR1,CCGGGTGTCTCAAGCTAGTCCATCTCTCGAGAGATGGACTAGCTTGAGACACTTTTTG,AATTCAAAAAGTGTCTCAAGCTAGTCCATCTCTCGAGAGATGGACTAGCTTGAGACAC,n/a
human,3903,LAIR1,XM_017026803.2,TRCN0000063590,NM_002287.2-253s1c1,TCCACATACAATGATACTGAA,pLKO.1,323,CDS,100,100,4.95,3.465,N,3903,LAIR1,CCGGTCCACATACAATGATACTGAACTCGAGTTCAGTATCATTGTATGTGGATTTTTG,AATTCAAAAATCCACATACAATGATACTGAACTCGAGTTCAGTATCATTGTATGTGGA,n/a
human,3903,LAIR1,XM_017026803.2,TRCN0000417660,NM_002287.3-630s21c1,CTAAATGGTCTGAGCAGAGTG,pLKO_005,447,CDS,100,100,4.05,2.835,N,3903,LAIR1,CCGGCTAAATGGTCTGAGCAGAGTGCTCGAGCACTCTGCTCAGACCATTTAGTTTTTG,AATTCAAAAACTAAATGGTCTGAGCAGAGTGCTCGAGCACTCTGCTCAGACCATTTAG,n/a
human,3903,LAIR1,XM_017026803.2,TRCN0000060329,NM_021270.2-508s1c1,CCTCCGGATTTGATGCACCAT,pLKO.1,564,CDS,95,100,2.64,1.32,Y,3904,LAIR2,CCGGCCTCCGGATTTGATGCACCATCTCGAGATGGTGCATCAAATCCGGAGGTTTTTG,AATTCAAAAACCTCCGGATTTGATGCACCATCTCGAGATGGTGCATCAAATCCGGAGG,n/a
human,3903,LAIR1,XM_017026803.2,TRCN0000063592,NM_002287.2-244s1c1,GAGAGTAGATCCACATACAAT,pLKO.1,314,CDS,95,95,,,N,3903,LAIR1,CCGGGAGAGTAGATCCACATACAATCTCGAGATTGTATGTGGATCTACTCTCTTTTTG,AATTCAAAAAGAGAGTAGATCCACATACAATCTCGAGATTGTATGTGGATCTACTCTC,n/a
human,3903,LAIR1,XM_017026803.2,TRCN0000433853,NM_002287.3-601s21c1,GCCTTATCGCTGCATCTATTA,pLKO_005,418,CDS,95,95,,,N,3903,LAIR1,CCGGGCCTTATCGCTGCATCTATTACTCGAGTAATAGATGCAGCGATAAGGCTTTTTG,AATTCAAAAAGCCTTATCGCTGCATCTATTACTCGAGTAATAGATGCAGCGATAAGGC,n/a
human,3903,LAIR1,XM_017026803.2,TRCN0000060332,NM_021270.2-376s1c1,GATTCCACATTGACTCAGTAA,pLKO.1,381,CDS,95,95,,,Y,3904,LAIR2,CCGGGATTCCACATTGACTCAGTAACTCGAGTTACTGAGTCAATGTGGAATCTTTTTG,AATTCAAAAAGATTCCACATTGACTCAGTAACTCGAGTTACTGAGTCAATGTGGAATC,n/a
human,3903,LAIR1,XM_017026803.2,TRCN0000134618,NM_175892.3-2193s1c1,GCTGGTGAAATGAAATCTCTT,pLKO.1,481,CDS,85,89,,,Y,1740,DLG2,CCGGGCTGGTGAAATGAAATCTCTTCTCGAGAAGAGATTTCATTTCACCAGCTTTTTG,AATTCAAAAAGCTGGTGAAATGAAATCTCTTCTCGAGAAGAGATTTCATTTCACCAGC,n/a
human,3903,LAIR1,XM_017026803.2,TRCN0000097088,NM_009515.1-520s1c1,GCACCAATCAATGAGGAGAGA,pLKO.1,578,CDS,85,89,,,Y,22376,Was,CCGGGCACCAATCAATGAGGAGAGACTCGAGTCTCTCCTCATTGATTGGTGCTTTTTG,AATTCAAAAAGCACCAATCAATGAGGAGAGACTCGAGTCTCTCCTCATTGATTGGTGC,n/a
human,3903,LAIR1,XM_017026803.2,TRCN0000375737,NM_023061.2-1045s21c1,TGGAGCTGCTGGTGAACTATG,pLKO_005,474,CDS,80,89,,,Y,84004,Mcam,CCGGTGGAGCTGCTGGTGAACTATGCTCGAGCATAGTTCACCAGCAGCTCCATTTTTG,AATTCAAAAATGGAGCTGCTGGTGAACTATGCTCGAGCATAGTTCACCAGCAGCTCCA,n/a
human,3903,LAIR1,XM_017026803.2,TRCN0000089750,NM_016958.1-832s1c1,CGAGGAGGAAATGGCCTCCAT,pLKO.1,588,CDS,80,89,,,Y,16664,Krt14,CCGGCGAGGAGGAAATGGCCTCCATCTCGAGATGGAGGCCATTTCCTCCTCGTTTTTG,AATTCAAAAACGAGGAGGAAATGGCCTCCATCTCGAGATGGAGGCCATTTCCTCCTCG,n/a
human,3903,LAIR1,XM_017026803.2,TRCN0000095698,NM_007970.1-436s1c1,GCACTGGTTCCCATCATGTAT,pLKO.1,656,CDS,86,85,,,Y,14055,Ezh1,CCGGGCACTGGTTCCCATCATGTATCTCGAGATACATGATGGGAACCAGTGCTTTTTG,AATTCAAAAAGCACTGGTTCCCATCATGTATCTCGAGATACATGATGGGAACCAGTGC,n/a
human,3903,LAIR1,XM_017026803.2,TRCN0000243654,XM_496983.3-913s21c1,ACCGAAGAGTGTCTCAAGTTC,pLKO_005,338,CDS,81,85,,,Y,,,CCGGACCGAAGAGTGTCTCAAGTTCCTCGAGGAACTTGAGACACTCTTCGGTTTTTTG,AATTCAAAAAACCGAAGAGTGTCTCAAGTTCCTCGAGGAACTTGAGACACTCTTCGGT,n/a
