Taxon,"Gene ID","Gene Symbol",Transcript,"Clone ID","Legacy Clone Name","Target Seq",Vector,"Match Position","Match Region","Match %","SDR Match %","Intrinsic Score","Adjusted Score","Matches Other Gene in Same Taxon?","Orig. Target Gene ID","Orig. Target Gene Symbol","Forward Oligo Sequence","Reverse Oligo Sequence",Addgene
human,54059,YBEY,NM_001314023.2,TRCN0000133988,NM_001006114.1-318s1c1,CATCTGAAAGCAGGTGAATTT,pLKO.1,194,CDS,100,100,13.2,9.24,N,54059,YBEY,CCGGCATCTGAAAGCAGGTGAATTTCTCGAGAAATTCACCTGCTTTCAGATGTTTTTG,AATTCAAAAACATCTGAAAGCAGGTGAATTTCTCGAGAAATTCACCTGCTTTCAGATG,n/a
human,54059,YBEY,NM_001314023.2,TRCN0000135168,NM_001006114.1-383s1c1,CCTAGGAGTGGAGTATATCTT,pLKO.1,259,CDS,100,100,5.625,3.9375,N,54059,YBEY,CCGGCCTAGGAGTGGAGTATATCTTCTCGAGAAGATATACTCCACTCCTAGGTTTTTG,AATTCAAAAACCTAGGAGTGGAGTATATCTTCTCGAGAAGATATACTCCACTCCTAGG,n/a
human,54059,YBEY,NM_001314023.2,TRCN0000135853,NM_001006114.1-162s1c1,CTTCGCAGTAAGATCGAGATT,pLKO.1,173,CDS,100,100,4.95,3.465,N,54059,YBEY,CCGGCTTCGCAGTAAGATCGAGATTCTCGAGAATCTCGATCTTACTGCGAAGTTTTTG,AATTCAAAAACTTCGCAGTAAGATCGAGATTCTCGAGAATCTCGATCTTACTGCGAAG,n/a
human,54059,YBEY,NM_001314023.2,TRCN0000134687,NM_001006114.1-360s1c1,GACTACAATTTGGGAGACATT,pLKO.1,236,CDS,100,100,4.95,3.465,N,54059,YBEY,CCGGGACTACAATTTGGGAGACATTCTCGAGAATGTCTCCCAAATTGTAGTCTTTTTG,AATTCAAAAAGACTACAATTTGGGAGACATTCTCGAGAATGTCTCCCAAATTGTAGTC,n/a
human,54059,YBEY,NM_001314023.2,TRCN0000133657,NM_001006114.1-393s1c1,GAGTATATCTTCCATCAGTGT,pLKO.1,269,CDS,100,100,2.64,1.848,N,54059,YBEY,CCGGGAGTATATCTTCCATCAGTGTCTCGAGACACTGATGGAAGATATACTCTTTTTG,AATTCAAAAAGAGTATATCTTCCATCAGTGTCTCGAGACACTGATGGAAGATATACTC,n/a
human,54059,YBEY,NM_001314023.2,TRCN0000135131,NM_001006114.1-354s1c1,CCAGATGACTACAATTTGGGA,pLKO.1,230,CDS,100,100,.75,.525,N,54059,YBEY,CCGGCCAGATGACTACAATTTGGGACTCGAGTCCCAAATTGTAGTCATCTGGTTTTTG,AATTCAAAAACCAGATGACTACAATTTGGGACTCGAGTCCCAAATTGTAGTCATCTGG,n/a
human,54059,YBEY,NM_001314023.2,TRCN0000307546,NM_026538.3-562s21c1,CTGTCACTTGCCTCGGATTTA,pLKO_005,343,CDS,85,89,,,Y,52513,Ddx56,CCGGCTGTCACTTGCCTCGGATTTACTCGAGTAAATCCGAGGCAAGTGACAGTTTTTG,AATTCAAAAACTGTCACTTGCCTCGGATTTACTCGAGTAAATCCGAGGCAAGTGACAG,n/a
human,54059,YBEY,NM_001314023.2,TRCN0000071441,NM_008321.1-259s1c1,GAAATCCTGCAGCGTGTCATA,pLKO.1,135,CDS,85,89,,,Y,15903,Id3,CCGGGAAATCCTGCAGCGTGTCATACTCGAGTATGACACGCTGCAGGATTTCTTTTTG,AATTCAAAAAGAAATCCTGCAGCGTGTCATACTCGAGTATGACACGCTGCAGGATTTC,n/a
human,54059,YBEY,NM_001314023.2,TRCN0000133681,NM_001006114.1-166s1c1,GCAGTAAGATCGAGATTGTAA,pLKO.1,177,CDS,80,89,,,N,54059,YBEY,CCGGGCAGTAAGATCGAGATTGTAACTCGAGTTACAATCTCGATCTTACTGCTTTTTG,AATTCAAAAAGCAGTAAGATCGAGATTGTAACTCGAGTTACAATCTCGATCTTACTGC,n/a
human,54059,YBEY,NM_001314023.2,TRCN0000076302,NM_024471.2-1182s1c1,CTTCATATAAAGCAGGTGAAT,pLKO.1,191,CDS,86,85,,,Y,79464,Lias,CCGGCTTCATATAAAGCAGGTGAATCTCGAGATTCACCTGCTTTATATGAAGTTTTTG,AATTCAAAAACTTCATATAAAGCAGGTGAATCTCGAGATTCACCTGCTTTATATGAAG,n/a
human,54059,YBEY,NM_001314023.2,TRCN0000318217,NM_024471.4-1181s21c1,CTTCATATAAAGCAGGTGAAT,pLKO_005,191,CDS,86,85,,,Y,79464,Lias,CCGGCTTCATATAAAGCAGGTGAATCTCGAGATTCACCTGCTTTATATGAAGTTTTTG,AATTCAAAAACTTCATATAAAGCAGGTGAATCTCGAGATTCACCTGCTTTATATGAAG,n/a
