Taxon,"Gene ID","Gene Symbol",Transcript,"Clone ID","Legacy Clone Name","Target Seq",Vector,"Match Position","Match Region","Match %","SDR Match %","Intrinsic Score","Adjusted Score","Matches Other Gene in Same Taxon?","Orig. Target Gene ID","Orig. Target Gene Symbol","Forward Oligo Sequence","Reverse Oligo Sequence",Addgene
human,253980,KCTD13,XM_017023106.2,TRCN0000044099,NM_178863.2-467s1c1,CTTTGGTACAATCCTCAATTA,pLKO.1,469,CDS,100,100,13.2,18.48,N,253980,KCTD13,CCGGCTTTGGTACAATCCTCAATTACTCGAGTAATTGAGGATTGTACCAAAGTTTTTG,AATTCAAAAACTTTGGTACAATCCTCAATTACTCGAGTAATTGAGGATTGTACCAAAG,n/a
human,253980,KCTD13,XM_017023106.2,TRCN0000044098,NM_178863.2-302s1c1,CCCGAACAGCAAATACGTGAA,pLKO.1,304,CDS,100,100,4.05,5.67,N,253980,KCTD13,CCGGCCCGAACAGCAAATACGTGAACTCGAGTTCACGTATTTGCTGTTCGGGTTTTTG,AATTCAAAAACCCGAACAGCAAATACGTGAACTCGAGTTCACGTATTTGCTGTTCGGG,n/a
human,253980,KCTD13,XM_017023106.2,TRCN0000300277,NM_178863.2-302s21c1,CCCGAACAGCAAATACGTGAA,pLKO_005,304,CDS,100,100,4.05,5.67,N,253980,KCTD13,CCGGCCCGAACAGCAAATACGTGAACTCGAGTTCACGTATTTGCTGTTCGGGTTTTTG,AATTCAAAAACCCGAACAGCAAATACGTGAACTCGAGTTCACGTATTTGCTGTTCGGG,n/a
human,253980,KCTD13,XM_017023106.2,TRCN0000165027,NM_001013636.1-513s1c1,GAACTCCTGACCTCAAGTGAT,pLKO.1,2450,3UTR,100,100,4.95,2.475,Y,387873,LOC387873,CCGGGAACTCCTGACCTCAAGTGATCTCGAGATCACTTGAGGTCAGGAGTTCTTTTTG,AATTCAAAAAGAACTCCTGACCTCAAGTGATCTCGAGATCACTTGAGGTCAGGAGTTC,n/a
human,253980,KCTD13,XM_017023106.2,TRCN0000155836,NM_198582.1-3275s1c1,CCCAAAGTGCTGGGATTACAA,pLKO.1,839,3UTR,95,100,5.625,2.8125,Y,377007,KLHL30,CCGGCCCAAAGTGCTGGGATTACAACTCGAGTTGTAATCCCAGCACTTTGGGTTTTTG,AATTCAAAAACCCAAAGTGCTGGGATTACAACTCGAGTTGTAATCCCAGCACTTTGGG,n/a
human,253980,KCTD13,XM_017023106.2,TRCN0000141025,NM_152361.1-835s1c1,CCCAAAGTGCTGGGATTACTT,pLKO.1,839,3UTR,90,100,5.625,2.8125,Y,126272,EID2B,CCGGCCCAAAGTGCTGGGATTACTTCTCGAGAAGTAATCCCAGCACTTTGGGTTTTTG,AATTCAAAAACCCAAAGTGCTGGGATTACTTCTCGAGAAGTAATCCCAGCACTTTGGG,n/a
human,253980,KCTD13,XM_017023106.2,TRCN0000140610,NM_025042.2-931s1c1,GCCTCTCAGGTTCAAGCAATT,pLKO.1,667,CDS,95,95,,,Y,,,CCGGGCCTCTCAGGTTCAAGCAATTCTCGAGAATTGCTTGAACCTGAGAGGCTTTTTG,AATTCAAAAAGCCTCTCAGGTTCAAGCAATTCTCGAGAATTGCTTGAACCTGAGAGGC,n/a
human,253980,KCTD13,XM_017023106.2,TRCN0000116737,NM_016369.3-2405s1c1,CCTCCCAAGTAGCTGGAATTA,pLKO.1,700,CDS,95,95,,,Y,51208,CLDN18,CCGGCCTCCCAAGTAGCTGGAATTACTCGAGTAATTCCAGCTACTTGGGAGGTTTTTG,AATTCAAAAACCTCCCAAGTAGCTGGAATTACTCGAGTAATTCCAGCTACTTGGGAGG,n/a
human,253980,KCTD13,XM_017023106.2,TRCN0000165534,NM_001012717.1-362s1c1,GAGACAGGGTTTCACCATGTT,pLKO.1,766,3UTR,95,95,,,Y,,,CCGGGAGACAGGGTTTCACCATGTTCTCGAGAACATGGTGAAACCCTGTCTCTTTTTG,AATTCAAAAAGAGACAGGGTTTCACCATGTTCTCGAGAACATGGTGAAACCCTGTCTC,n/a
human,253980,KCTD13,XM_017023106.2,TRCN0000168774,NM_001013670.1-1394s1c1,GAGATGGAGTTTCACCATGTT,pLKO.1,2414,3UTR,95,95,,,Y,400464,LOC400464,CCGGGAGATGGAGTTTCACCATGTTCTCGAGAACATGGTGAAACTCCATCTCTTTTTG,AATTCAAAAAGAGATGGAGTTTCACCATGTTCTCGAGAACATGGTGAAACTCCATCTC,n/a
human,253980,KCTD13,XM_017023106.2,TRCN0000204533,NM_001013675.1-1987s1c1,CCTCCCAAAGTGCTGGAATTA,pLKO.1,2484,3UTR,90,95,,,Y,400891,LRRC74B,CCGGCCTCCCAAAGTGCTGGAATTACTCGAGTAATTCCAGCACTTTGGGAGGTTTTTG,AATTCAAAAACCTCCCAAAGTGCTGGAATTACTCGAGTAATTCCAGCACTTTGGGAGG,n/a
human,253980,KCTD13,XM_017023106.2,TRCN0000072628,NM_016065.3-1636s1c1,CCTCCCAAAGTGCTAGGATTA,pLKO.1,2484,3UTR,90,95,,,Y,51021,MRPS16,CCGGCCTCCCAAAGTGCTAGGATTACTCGAGTAATCCTAGCACTTTGGGAGGTTTTTG,AATTCAAAAACCTCCCAAAGTGCTAGGATTACTCGAGTAATCCTAGCACTTTGGGAGG,n/a
human,253980,KCTD13,XM_017023106.2,TRCN0000198642,NM_198647.1-2364s1c1,CGAGTATGTGTGTGTGTGTAT,pLKO.1,2804,3UTR,90,95,,,Y,381085,Tbc1d22b,CCGGCGAGTATGTGTGTGTGTGTATCTCGAGATACACACACACACATACTCGTTTTTG,AATTCAAAAACGAGTATGTGTGTGTGTGTATCTCGAGATACACACACACACATACTCG,n/a
human,253980,KCTD13,XM_017023106.2,TRCN0000164801,NM_016534.2-1646s1c1,CCTCCCAAAGTACTGGGATTA,pLKO.1,2484,3UTR,90,95,,,Y,51275,MAPKAPK5-AS1,CCGGCCTCCCAAAGTACTGGGATTACTCGAGTAATCCCAGTACTTTGGGAGGTTTTTG,AATTCAAAAACCTCCCAAAGTACTGGGATTACTCGAGTAATCCCAGTACTTTGGGAGG,n/a
human,253980,KCTD13,XM_017023106.2,TRCN0000008902,NM_016540.2-2291s1c1,CCTCCCAAAGTGTTGGGATTA,pLKO.1,2484,3UTR,90,95,,,Y,10888,GPR83,CCGGCCTCCCAAAGTGTTGGGATTACTCGAGTAATCCCAACACTTTGGGAGGTTTTTG,AATTCAAAAACCTCCCAAAGTGTTGGGATTACTCGAGTAATCCCAACACTTTGGGAGG,n/a
human,253980,KCTD13,XM_017023106.2,TRCN0000156315,NM_020702.1-3633s1c1,CCTCCCAAAGTGTTGGGATTA,pLKO.1,2484,3UTR,90,95,,,Y,57462,MYORG,CCGGCCTCCCAAAGTGTTGGGATTACTCGAGTAATCCCAACACTTTGGGAGGTTTTTG,AATTCAAAAACCTCCCAAAGTGTTGGGATTACTCGAGTAATCCCAACACTTTGGGAGG,n/a
human,253980,KCTD13,XM_017023106.2,TRCN0000116227,NM_024930.1-2895s1c1,CCTCCCAAAGTTCTGGGATTA,pLKO.1,2484,3UTR,90,95,,,Y,79993,ELOVL7,CCGGCCTCCCAAAGTTCTGGGATTACTCGAGTAATCCCAGAACTTTGGGAGGTTTTTG,AATTCAAAAACCTCCCAAAGTTCTGGGATTACTCGAGTAATCCCAGAACTTTGGGAGG,n/a
human,253980,KCTD13,XM_017023106.2,TRCN0000164591,NM_003281.3-2102s1c1,CCTCCCAAAGTTCTGGGATTA,pLKO.1,2484,3UTR,90,95,,,Y,7135,TNNI1,CCGGCCTCCCAAAGTTCTGGGATTACTCGAGTAATCCCAGAACTTTGGGAGGTTTTTG,AATTCAAAAACCTCCCAAAGTTCTGGGATTACTCGAGTAATCCCAGAACTTTGGGAGG,n/a
human,253980,KCTD13,XM_017023106.2,TRCN0000040213,NM_000618.2-6169s1c1,CCTCCCAAATTGCTGGGATTA,pLKO.1,2484,3UTR,90,95,,,Y,3479,IGF1,CCGGCCTCCCAAATTGCTGGGATTACTCGAGTAATCCCAGCAATTTGGGAGGTTTTTG,AATTCAAAAACCTCCCAAATTGCTGGGATTACTCGAGTAATCCCAGCAATTTGGGAGG,n/a
human,253980,KCTD13,XM_017023106.2,TRCN0000233159,NM_003365.2-1376s21c1,TCTGCTCCAAGTACATCTATG,pLKO_005,1481,3UTR,85,95,,,Y,7384,UQCRC1,CCGGTCTGCTCCAAGTACATCTATGCTCGAGCATAGATGTACTTGGAGCAGATTTTTG,AATTCAAAAATCTGCTCCAAGTACATCTATGCTCGAGCATAGATGTACTTGGAGCAGA,n/a
human,253980,KCTD13,XM_017023106.2,TRCN0000162795,NM_017842.1-1079s1c1,CTTCCAAAGTGCTGGGATTAT,pLKO.1,2485,3UTR,85,95,,,Y,55652,SLC48A1,CCGGCTTCCAAAGTGCTGGGATTATCTCGAGATAATCCCAGCACTTTGGAAGTTTTTG,AATTCAAAAACTTCCAAAGTGCTGGGATTATCTCGAGATAATCCCAGCACTTTGGAAG,n/a
human,253980,KCTD13,XM_017023106.2,TRCN0000140657,NM_012099.1-2957s1c1,CCTCCCAAAGTGCTAGGATAA,pLKO.1,2484,3UTR,85,95,,,Y,10849,CD3EAP,CCGGCCTCCCAAAGTGCTAGGATAACTCGAGTTATCCTAGCACTTTGGGAGGTTTTTG,AATTCAAAAACCTCCCAAAGTGCTAGGATAACTCGAGTTATCCTAGCACTTTGGGAGG,n/a
human,253980,KCTD13,XM_017023106.2,TRCN0000148755,NM_032285.1-1973s1c1,CGAACTCCTGACTCAAATGAT,pLKO.1,2449,3UTR,90,90,,,Y,84245,MRI1,CCGGCGAACTCCTGACTCAAATGATCTCGAGATCATTTGAGTCAGGAGTTCGTTTTTG,AATTCAAAAACGAACTCCTGACTCAAATGATCTCGAGATCATTTGAGTCAGGAGTTCG,n/a
human,253980,KCTD13,XM_017023106.2,TRCN0000047783,NM_017516.1-1624s1c1,GCCTCCAAAGTGCTGGAATTA,pLKO.1,2483,3UTR,86,90,,,Y,54734,RAB39A,CCGGGCCTCCAAAGTGCTGGAATTACTCGAGTAATTCCAGCACTTTGGAGGCTTTTTG,AATTCAAAAAGCCTCCAAAGTGCTGGAATTACTCGAGTAATTCCAGCACTTTGGAGGC,n/a
human,253980,KCTD13,XM_017023106.2,TRCN0000091448,NM_013513.1-2495s1c1,CCTCCCAAGTACTGGGATTAA,pLKO.1,2484,3UTR,86,90,,,Y,13828,Epb42,CCGGCCTCCCAAGTACTGGGATTAACTCGAGTTAATCCCAGTACTTGGGAGGTTTTTG,AATTCAAAAACCTCCCAAGTACTGGGATTAACTCGAGTTAATCCCAGTACTTGGGAGG,n/a
human,253980,KCTD13,XM_017023106.2,TRCN0000069499,NM_172747.1-288s1c1,CCCGAACAGCAAGTATGTGAA,pLKO.1,304,CDS,90,89,,,N,233877,Kctd13,CCGGCCCGAACAGCAAGTATGTGAACTCGAGTTCACATACTTGCTGTTCGGGTTTTTG,AATTCAAAAACCCGAACAGCAAGTATGTGAACTCGAGTTCACATACTTGCTGTTCGGG,n/a
human,253980,KCTD13,XM_017023106.2,TRCN0000139587,NM_052966.1-4502s1c1,CGTCCCAAGTAGCTGGAATTA,pLKO.1,700,CDS,90,89,,,Y,116496,NIBAN1,CCGGCGTCCCAAGTAGCTGGAATTACTCGAGTAATTCCAGCTACTTGGGACGTTTTTG,AATTCAAAAACGTCCCAAGTAGCTGGAATTACTCGAGTAATTCCAGCTACTTGGGACG,n/a
human,253980,KCTD13,XM_017023106.2,TRCN0000149509,NM_145283.1-707s1c1,GTTCAAGTGATTCTCTAGCCT,pLKO.1,2323,3UTR,90,89,,,Y,158046,NXNL2,CCGGGTTCAAGTGATTCTCTAGCCTCTCGAGAGGCTAGAGAATCACTTGAACTTTTTG,AATTCAAAAAGTTCAAGTGATTCTCTAGCCTCTCGAGAGGCTAGAGAATCACTTGAAC,n/a
human,253980,KCTD13,XM_017023106.2,TRCN0000172710,NM_032937.2-575s1c1,GAACTCCTGACCTCAAGCAAT,pLKO.1,2450,3UTR,90,89,,,Y,85026,ARRDC1-AS1,CCGGGAACTCCTGACCTCAAGCAATCTCGAGATTGCTTGAGGTCAGGAGTTCTTTTTG,AATTCAAAAAGAACTCCTGACCTCAAGCAATCTCGAGATTGCTTGAGGTCAGGAGTTC,n/a
human,253980,KCTD13,XM_017023106.2,TRCN0000162985,NM_207497.1-342s1c1,GAGACAAGGTTTCACCATGTT,pLKO.1,766,3UTR,90,89,,,Y,401253,LINC00336,CCGGGAGACAAGGTTTCACCATGTTCTCGAGAACATGGTGAAACCTTGTCTCTTTTTG,AATTCAAAAAGAGACAAGGTTTCACCATGTTCTCGAGAACATGGTGAAACCTTGTCTC,n/a
human,253980,KCTD13,XM_017023106.2,TRCN0000155187,NM_001003795.1-3305s1c1,GAGATGAGGTTTCACCATGTT,pLKO.1,766,3UTR,90,89,,,Y,389524,GTF2IRD2B,CCGGGAGATGAGGTTTCACCATGTTCTCGAGAACATGGTGAAACCTCATCTCTTTTTG,AATTCAAAAAGAGATGAGGTTTCACCATGTTCTCGAGAACATGGTGAAACCTCATCTC,n/a
human,253980,KCTD13,XM_017023106.2,TRCN0000140238,NM_024895.3-1807s1c1,GTCTCCCAAAGTGCTAGGATT,pLKO.1,2483,3UTR,90,89,,,Y,79955,PDZD7,CCGGGTCTCCCAAAGTGCTAGGATTCTCGAGAATCCTAGCACTTTGGGAGACTTTTTG,AATTCAAAAAGTCTCCCAAAGTGCTAGGATTCTCGAGAATCCTAGCACTTTGGGAGAC,n/a
human,253980,KCTD13,XM_017023106.2,TRCN0000129445,NM_145048.2-1500s1c1,GACTTCCAAAGTGCTGGGATT,pLKO.1,2483,3UTR,90,89,,,Y,133015,PACRGL,CCGGGACTTCCAAAGTGCTGGGATTCTCGAGAATCCCAGCACTTTGGAAGTCTTTTTG,AATTCAAAAAGACTTCCAAAGTGCTGGGATTCTCGAGAATCCCAGCACTTTGGAAGTC,n/a
human,253980,KCTD13,XM_017023106.2,TRCN0000140759,NM_018265.1-3067s1c1,GCCTTTCAAAGTGCTGGGATT,pLKO.1,2483,3UTR,90,89,,,Y,55765,INAVA,CCGGGCCTTTCAAAGTGCTGGGATTCTCGAGAATCCCAGCACTTTGAAAGGCTTTTTG,AATTCAAAAAGCCTTTCAAAGTGCTGGGATTCTCGAGAATCCCAGCACTTTGAAAGGC,n/a
human,253980,KCTD13,XM_017023106.2,TRCN0000155070,NM_017873.2-2761s1c1,GCCTTTCAAAGTGCTGGGATT,pLKO.1,2483,3UTR,90,89,,,Y,140459,ASB6,CCGGGCCTTTCAAAGTGCTGGGATTCTCGAGAATCCCAGCACTTTGAAAGGCTTTTTG,AATTCAAAAAGCCTTTCAAAGTGCTGGGATTCTCGAGAATCCCAGCACTTTGAAAGGC,n/a
human,253980,KCTD13,XM_017023106.2,TRCN0000165025,NM_207497.1-421s1c1,GTGCTAGGATTATAGGCGTGA,pLKO.1,845,3UTR,90,89,,,Y,401253,LINC00336,CCGGGTGCTAGGATTATAGGCGTGACTCGAGTCACGCCTATAATCCTAGCACTTTTTG,AATTCAAAAAGTGCTAGGATTATAGGCGTGACTCGAGTCACGCCTATAATCCTAGCAC,n/a
human,253980,KCTD13,XM_017023106.2,TRCN0000140374,NM_025042.2-1098s1c1,GCTTCCCAAAGTACTGGGATT,pLKO.1,2483,3UTR,90,89,,,Y,,,CCGGGCTTCCCAAAGTACTGGGATTCTCGAGAATCCCAGTACTTTGGGAAGCTTTTTG,AATTCAAAAAGCTTCCCAAAGTACTGGGATTCTCGAGAATCCCAGTACTTTGGGAAGC,n/a
human,253980,KCTD13,XM_017023106.2,TRCN0000146508,NM_014521.1-1730s1c1,CGTGTGGGACTTCATCAATAA,pLKO.1,1213,3UTR,85,89,,,Y,23677,SH3BP4,CCGGCGTGTGGGACTTCATCAATAACTCGAGTTATTGATGAAGTCCCACACGTTTTTG,AATTCAAAAACGTGTGGGACTTCATCAATAACTCGAGTTATTGATGAAGTCCCACACG,n/a
human,253980,KCTD13,XM_017023106.2,TRCN0000129384,NM_020814.1-3158s1c1,GCAGGAGCAGTTCTGCTATTT,pLKO.1,968,3UTR,85,89,,,Y,57574,MARCHF4,CCGGGCAGGAGCAGTTCTGCTATTTCTCGAGAAATAGCAGAACTGCTCCTGCTTTTTG,AATTCAAAAAGCAGGAGCAGTTCTGCTATTTCTCGAGAAATAGCAGAACTGCTCCTGC,n/a
human,253980,KCTD13,XM_017023106.2,TRCN0000122142,NM_018143.1-1465s1c1,GCACCAAAGATTCTTCGAGAT,pLKO.1,2770,3UTR,85,89,,,Y,55175,KLHL11,CCGGGCACCAAAGATTCTTCGAGATCTCGAGATCTCGAAGAATCTTTGGTGCTTTTTG,AATTCAAAAAGCACCAAAGATTCTTCGAGATCTCGAGATCTCGAAGAATCTTTGGTGC,n/a
human,253980,KCTD13,XM_017023106.2,TRCN0000042823,NM_024055.2-973s1c1,CCTCACAAAGTGCTAGGATTA,pLKO.1,2484,3UTR,85,89,,,Y,64924,SLC30A5,CCGGCCTCACAAAGTGCTAGGATTACTCGAGTAATCCTAGCACTTTGTGAGGTTTTTG,AATTCAAAAACCTCACAAAGTGCTAGGATTACTCGAGTAATCCTAGCACTTTGTGAGG,n/a
human,253980,KCTD13,XM_017023106.2,TRCN0000082462,XM_371492.2-638s1c1,CCTCCCAAAGTGCCAGGATTA,pLKO.1,2484,3UTR,85,89,,,Y,388949,LOC388949,CCGGCCTCCCAAAGTGCCAGGATTACTCGAGTAATCCTGGCACTTTGGGAGGTTTTTG,AATTCAAAAACCTCCCAAAGTGCCAGGATTACTCGAGTAATCCTGGCACTTTGGGAGG,n/a
human,253980,KCTD13,XM_017023106.2,TRCN0000165736,NM_175901.3-1946s1c1,CCTCCCTAAGTGTTGGGATTA,pLKO.1,2484,3UTR,85,89,,,Y,283932,FBXL19-AS1,CCGGCCTCCCTAAGTGTTGGGATTACTCGAGTAATCCCAACACTTAGGGAGGTTTTTG,AATTCAAAAACCTCCCTAAGTGTTGGGATTACTCGAGTAATCCCAACACTTAGGGAGG,n/a
human,253980,KCTD13,XM_017023106.2,TRCN0000166560,NM_207497.1-412s1c1,CCTCCGAAAGTGCTAGGATTA,pLKO.1,2484,3UTR,85,89,,,Y,401253,LINC00336,CCGGCCTCCGAAAGTGCTAGGATTACTCGAGTAATCCTAGCACTTTCGGAGGTTTTTG,AATTCAAAAACCTCCGAAAGTGCTAGGATTACTCGAGTAATCCTAGCACTTTCGGAGG,n/a
human,253980,KCTD13,XM_017023106.2,TRCN0000164091,NM_024795.1-1273s1c1,CCTCCTAAAGTGCTGCGATTA,pLKO.1,2484,3UTR,85,89,,,Y,79853,TM4SF20,CCGGCCTCCTAAAGTGCTGCGATTACTCGAGTAATCGCAGCACTTTAGGAGGTTTTTG,AATTCAAAAACCTCCTAAAGTGCTGCGATTACTCGAGTAATCGCAGCACTTTAGGAGG,n/a
human,253980,KCTD13,XM_017023106.2,TRCN0000091420,NM_007599.1-1245s1c1,TCCCATCTTCAAGCAATTCTT,pLKO.1,670,CDS,85,89,,,Y,12332,Capg,CCGGTCCCATCTTCAAGCAATTCTTCTCGAGAAGAATTGCTTGAAGATGGGATTTTTG,AATTCAAAAATCCCATCTTCAAGCAATTCTTCTCGAGAAGAATTGCTTGAAGATGGGA,n/a
human,253980,KCTD13,XM_017023106.2,TRCN0000318310,NM_007599.3-1055s21c1,TCCCATCTTCAAGCAATTCTT,pLKO_005,670,CDS,85,89,,,Y,12332,Capg,CCGGTCCCATCTTCAAGCAATTCTTCTCGAGAAGAATTGCTTGAAGATGGGATTTTTG,AATTCAAAAATCCCATCTTCAAGCAATTCTTCTCGAGAAGAATTGCTTGAAGATGGGA,n/a
human,253980,KCTD13,XM_017023106.2,TRCN0000148469,NM_152459.2-1181s1c1,CTGGGTTCAAGCAATTCTCTT,pLKO.1,672,CDS,85,89,,,Y,146556,C16orf89,CCGGCTGGGTTCAAGCAATTCTCTTCTCGAGAAGAGAATTGCTTGAACCCAGTTTTTG,AATTCAAAAACTGGGTTCAAGCAATTCTCTTCTCGAGAAGAGAATTGCTTGAACCCAG,n/a
human,253980,KCTD13,XM_017023106.2,TRCN0000141125,NM_153233.1-1432s1c1,CAGGTTCAAGAGATTCTCCTA,pLKO.1,673,CDS,85,89,,,Y,163183,SYNE4,CCGGCAGGTTCAAGAGATTCTCCTACTCGAGTAGGAGAATCTCTTGAACCTGTTTTTG,AATTCAAAAACAGGTTCAAGAGATTCTCCTACTCGAGTAGGAGAATCTCTTGAACCTG,n/a
human,253980,KCTD13,XM_017023106.2,TRCN0000130146,NM_207443.1-652s1c1,CAGGTTCAAGTGATTCTCCTA,pLKO.1,673,CDS,85,89,,,Y,400242,DICER1-AS1,CCGGCAGGTTCAAGTGATTCTCCTACTCGAGTAGGAGAATCACTTGAACCTGTTTTTG,AATTCAAAAACAGGTTCAAGTGATTCTCCTACTCGAGTAGGAGAATCACTTGAACCTG,n/a
human,253980,KCTD13,XM_017023106.2,TRCN0000163829,NM_173639.1-1102s1c1,CCTCCCAAATTACTGGGATTA,pLKO.1,2484,3UTR,85,89,,,Y,284618,RUSC1-AS1,CCGGCCTCCCAAATTACTGGGATTACTCGAGTAATCCCAGTAATTTGGGAGGTTTTTG,AATTCAAAAACCTCCCAAATTACTGGGATTACTCGAGTAATCCCAGTAATTTGGGAGG,n/a
human,253980,KCTD13,XM_017023106.2,TRCN0000057398,NM_002261.1-793s1c1,CCTCCCAAGTTGCTGGGATTA,pLKO.1,2484,3UTR,85,89,,,Y,3823,KLRC3,CCGGCCTCCCAAGTTGCTGGGATTACTCGAGTAATCCCAGCAACTTGGGAGGTTTTTG,AATTCAAAAACCTCCCAAGTTGCTGGGATTACTCGAGTAATCCCAGCAACTTGGGAGG,n/a
human,253980,KCTD13,XM_017023106.2,TRCN0000084741,NM_011541.3-519s1c1,CTTCTGATTCTGTGCGATTAA,pLKO.1,1648,3UTR,80,89,,,Y,21399,Tcea1,CCGGCTTCTGATTCTGTGCGATTAACTCGAGTTAATCGCACAGAATCAGAAGTTTTTG,AATTCAAAAACTTCTGATTCTGTGCGATTAACTCGAGTTAATCGCACAGAATCAGAAG,n/a
human,253980,KCTD13,XM_017023106.2,TRCN0000316013,NM_011541.4-627s21c1,CTTCTGATTCTGTGCGATTAA,pLKO_005,1648,3UTR,80,89,,,Y,21399,Tcea1,CCGGCTTCTGATTCTGTGCGATTAACTCGAGTTAATCGCACAGAATCAGAAGTTTTTG,AATTCAAAAACTTCTGATTCTGTGCGATTAACTCGAGTTAATCGCACAGAATCAGAAG,n/a
human,253980,KCTD13,XM_017023106.2,TRCN0000017961,NM_033178.1-627s1c1,GCTCTCCTTGCCAGGTTCCAA,pLKO.1,1160,3UTR,80,89,,,Y,22947,DUX4L1,CCGGGCTCTCCTTGCCAGGTTCCAACTCGAGTTGGAACCTGGCAAGGAGAGCTTTTTG,AATTCAAAAAGCTCTCCTTGCCAGGTTCCAACTCGAGTTGGAACCTGGCAAGGAGAGC,n/a
human,253980,KCTD13,XM_017023106.2,TRCN0000168807,NM_178520.2-2253s1c1,GCTGATCTCAAACTCCTGATA,pLKO.1,2441,3UTR,80,89,,,Y,284186,TMEM105,CCGGGCTGATCTCAAACTCCTGATACTCGAGTATCAGGAGTTTGAGATCAGCTTTTTG,AATTCAAAAAGCTGATCTCAAACTCCTGATACTCGAGTATCAGGAGTTTGAGATCAGC,n/a
human,253980,KCTD13,XM_017023106.2,TRCN0000021599,NM_052843.1-20060s1c1,CCTTCTTACCTCACTCAACTT,pLKO.1,2290,3UTR,81,85,,,Y,84033,OBSCN,CCGGCCTTCTTACCTCACTCAACTTCTCGAGAAGTTGAGTGAGGTAAGAAGGTTTTTG,AATTCAAAAACCTTCTTACCTCACTCAACTTCTCGAGAAGTTGAGTGAGGTAAGAAGG,n/a
human,253980,KCTD13,XM_017023106.2,TRCN0000181168,NM_024123.1-152s1c1,CTTGTGGCATCAGTATTGGCA,pLKO.1,2644,3UTR,77,85,,,Y,79136,LY6G6E,CCGGCTTGTGGCATCAGTATTGGCACTCGAGTGCCAATACTGATGCCACAAGTTTTTG,AATTCAAAAACTTGTGGCATCAGTATTGGCACTCGAGTGCCAATACTGATGCCACAAG,n/a
