Taxon,"Gene ID","Gene Symbol",Transcript,"Clone ID","Legacy Clone Name","Target Seq",Vector,"Match Position","Match Region","Match %","SDR Match %","Intrinsic Score","Adjusted Score","Matches Other Gene in Same Taxon?","Orig. Target Gene ID","Orig. Target Gene Symbol","Forward Oligo Sequence","Reverse Oligo Sequence",Addgene
human,10018,BCL2L11,XM_011510461.3,TRCN0000356026,NM_138621.3-559s21c1,CGATCCTCCAGTGGGTATTTC,pLKO_005,613,CDS,100,100,13.2,9.24,N,10018,BCL2L11,CCGGCGATCCTCCAGTGGGTATTTCCTCGAGGAAATACCCACTGGAGGATCGTTTTTG,AATTCAAAAACGATCCTCCAGTGGGTATTTCCTCGAGGAAATACCCACTGGAGGATCG,n/a
human,10018,BCL2L11,XM_011510461.3,TRCN0000001052,NM_138621.x-267s1c1,GTCTCGATCCTCCAGTGGGTA,pLKO.1,609,CDS,100,100,.88,.616,N,10018,BCL2L11,CCGGGTCTCGATCCTCCAGTGGGTACTCGAGTACCCACTGGAGGATCGAGACTTTTTG,AATTCAAAAAGTCTCGATCCTCCAGTGGGTACTCGAGTACCCACTGGAGGATCGAGAC,n/a
human,10018,BCL2L11,XM_011510461.3,TRCN0000256430,NM_001113356.1-1456s21c1,CAGGCCTTCACCACTATCTAT,pLKO_005,706,CDS,86,95,,,N,667277,C1rb,CCGGCAGGCCTTCACCACTATCTATCTCGAGATAGATAGTGGTGAAGGCCTGTTTTTG,AATTCAAAAACAGGCCTTCACCACTATCTATCTCGAGATAGATAGTGGTGAAGGCCTG,n/a
human,10018,BCL2L11,XM_011510461.3,TRCN0000009692,NM_009754.1-35s1c1,GTGACAGAGAAGGTGGACAAT,pLKO.1,377,CDS,90,89,,,Y,12125,Bcl2l11,CCGGGTGACAGAGAAGGTGGACAATCTCGAGATTGTCCACCTTCTCTGTCACTTTTTG,AATTCAAAAAGTGACAGAGAAGGTGGACAATCTCGAGATTGTCCACCTTCTCTGTCAC,n/a
human,10018,BCL2L11,XM_011510461.3,TRCN0000231243,NM_009754.3-264s21c1,TGACAGAGAAGGTGGACAATT,pLKO_005,378,CDS,90,89,,,Y,12125,Bcl2l11,CCGGTGACAGAGAAGGTGGACAATTCTCGAGAATTGTCCACCTTCTCTGTCATTTTTG,AATTCAAAAATGACAGAGAAGGTGGACAATTCTCGAGAATTGTCCACCTTCTCTGTCA,n/a
human,10018,BCL2L11,XM_011510461.3,TRCN0000007083,NM_031464.2-431s1c1,GCCTTCAACCACTATCAGAAT,pLKO.1,709,CDS,85,89,,,Y,83694,RPS6KL1,CCGGGCCTTCAACCACTATCAGAATCTCGAGATTCTGATAGTGGTTGAAGGCTTTTTG,AATTCAAAAAGCCTTCAACCACTATCAGAATCTCGAGATTCTGATAGTGGTTGAAGGC,n/a
human,10018,BCL2L11,XM_011510461.3,TRCN0000267507,NM_178259.3-11991s21c1,CCGAGAAGGTCGCACAATTAT,pLKO_005,381,CDS,80,89,,,N,268379,Abca13,CCGGCCGAGAAGGTCGCACAATTATCTCGAGATAATTGTGCGACCTTCTCGGTTTTTG,AATTCAAAAACCGAGAAGGTCGCACAATTATCTCGAGATAATTGTGCGACCTTCTCGG,n/a
human,10018,BCL2L11,XM_011510461.3,TRCN0000249221,NM_026983.2-713s21c1,CTGCCAGCTCTGGCCATTTAT,pLKO_005,542,CDS,80,89,,,Y,69187,Erp27,CCGGCTGCCAGCTCTGGCCATTTATCTCGAGATAAATGGCCAGAGCTGGCAGTTTTTG,AATTCAAAAACTGCCAGCTCTGGCCATTTATCTCGAGATAAATGGCCAGAGCTGGCAG,n/a
human,10018,BCL2L11,XM_011510461.3,TRCN0000073723,NM_003235.3-6055s1c1,GCACTGGCTTTGGATTTCTAA,pLKO.1,766,CDS,81,85,,,Y,7038,TG,CCGGGCACTGGCTTTGGATTTCTAACTCGAGTTAGAAATCCAAAGCCAGTGCTTTTTG,AATTCAAAAAGCACTGGCTTTGGATTTCTAACTCGAGTTAGAAATCCAAAGCCAGTGC,n/a
