Taxon,"Gene ID","Gene Symbol",Transcript,"Clone ID","Legacy Clone Name","Target Seq",Vector,"Match Position","Match Region","Match %","SDR Match %","Intrinsic Score","Adjusted Score","Matches Other Gene in Same Taxon?","Orig. Target Gene ID","Orig. Target Gene Symbol","Forward Oligo Sequence","Reverse Oligo Sequence",Addgene
human,135138,PACRG,XM_017010281.2,TRCN0000129893,NM_152410.1-527s1c1,GAAGCTGGATTACCATCATTA,pLKO.1,455,5UTR,100,100,13.2,9.24,N,135138,PACRG,CCGGGAAGCTGGATTACCATCATTACTCGAGTAATGATGGTAATCCAGCTTCTTTTTG,AATTCAAAAAGAAGCTGGATTACCATCATTACTCGAGTAATGATGGTAATCCAGCTTC,n/a
human,135138,PACRG,XM_017010281.2,TRCN0000129133,NM_152410.1-525s1c1,GAGAAGCTGGATTACCATCAT,pLKO.1,453,5UTR,100,100,4.95,3.465,N,135138,PACRG,CCGGGAGAAGCTGGATTACCATCATCTCGAGATGATGGTAATCCAGCTTCTCTTTTTG,AATTCAAAAAGAGAAGCTGGATTACCATCATCTCGAGATGATGGTAATCCAGCTTCTC,n/a
human,135138,PACRG,XM_017010281.2,TRCN0000191049,NM_027032.1-859s1c1,CCTGAACATCTTTAAGAACAT,pLKO.1,740,CDS,95,95,,,Y,69310,Pacrg,CCGGCCTGAACATCTTTAAGAACATCTCGAGATGTTCTTAAAGATGTTCAGGTTTTTG,AATTCAAAAACCTGAACATCTTTAAGAACATCTCGAGATGTTCTTAAAGATGTTCAGG,n/a
human,135138,PACRG,XM_017010281.2,TRCN0000069662,NM_019664.3-1158s1c1,CCTGTGGTTTCTCTCTCCAAA,pLKO.1,1117,CDS,90,90,,,Y,16516,Kcnj15,CCGGCCTGTGGTTTCTCTCTCCAAACTCGAGTTTGGAGAGAGAAACCACAGGTTTTTG,AATTCAAAAACCTGTGGTTTCTCTCTCCAAACTCGAGTTTGGAGAGAGAAACCACAGG,n/a
human,135138,PACRG,XM_017010281.2,TRCN0000240303,XM_902322.3-2851s21c1,GAAATTGTGAGCTGGATTAAA,pLKO_005,447,5UTR,81,90,,,N,665211,Gm14326,CCGGGAAATTGTGAGCTGGATTAAACTCGAGTTTAATCCAGCTCACAATTTCTTTTTG,AATTCAAAAAGAAATTGTGAGCTGGATTAAACTCGAGTTTAATCCAGCTCACAATTTC,n/a
human,135138,PACRG,XM_017010281.2,TRCN0000189879,NM_027032.1-745s1c1,CCTCCGAAACAGACAGATCAT,pLKO.1,626,CDS,90,89,,,Y,69310,Pacrg,CCGGCCTCCGAAACAGACAGATCATCTCGAGATGATCTGTCTGTTTCGGAGGTTTTTG,AATTCAAAAACCTCCGAAACAGACAGATCATCTCGAGATGATCTGTCTGTTTCGGAGG,n/a
human,135138,PACRG,XM_017010281.2,TRCN0000226167,XM_129661.10-1007s21c1,TTACAGAAATGTTCCTCTTAA,pLKO_005,1149,CDS,85,89,,,Y,68972,Tatdn3,CCGGTTACAGAAATGTTCCTCTTAACTCGAGTTAAGAGGAACATTTCTGTAATTTTTG,AATTCAAAAATTACAGAAATGTTCCTCTTAACTCGAGTTAAGAGGAACATTTCTGTAA,n/a
human,135138,PACRG,XM_017010281.2,TRCN0000064364,NM_000785.2-1279s1c1,CTGGTCACTCTGTGTCACTAT,pLKO.1,639,CDS,85,89,,,Y,1594,CYP27B1,CCGGCTGGTCACTCTGTGTCACTATCTCGAGATAGTGACACAGAGTGACCAGTTTTTG,AATTCAAAAACTGGTCACTCTGTGTCACTATCTCGAGATAGTGACACAGAGTGACCAG,n/a
human,135138,PACRG,XM_017010281.2,TRCN0000087157,XM_356875.3-51s1c1,CCCAGTGCTCACCCAGGTCAA,pLKO.1,1068,CDS,85,89,,,Y,383101,Gm1246,CCGGCCCAGTGCTCACCCAGGTCAACTCGAGTTGACCTGGGTGAGCACTGGGTTTTTG,AATTCAAAAACCCAGTGCTCACCCAGGTCAACTCGAGTTGACCTGGGTGAGCACTGGG,n/a
human,135138,PACRG,XM_017010281.2,TRCN0000143404,NM_006336.2-2095s1c1,CACAGATGAAACTCCTGACAA,pLKO.1,353,5UTR,81,85,,,Y,10444,ZER1,CCGGCACAGATGAAACTCCTGACAACTCGAGTTGTCAGGAGTTTCATCTGTGTTTTTG,AATTCAAAAACACAGATGAAACTCCTGACAACTCGAGTTGTCAGGAGTTTCATCTGTG,n/a
human,135138,PACRG,XM_017010281.2,TRCN0000366228,NM_010164.2-1437s21c1,AGTCCTTCCACACCCATTAAA,pLKO_005,584,CDS,77,85,,,Y,14048,Eya1,CCGGAGTCCTTCCACACCCATTAAACTCGAGTTTAATGGGTGTGGAAGGACTTTTTTG,AATTCAAAAAAGTCCTTCCACACCCATTAAACTCGAGTTTAATGGGTGTGGAAGGACT,n/a
