Taxon,"Gene ID","Gene Symbol",Transcript,"Clone ID","Legacy Clone Name","Target Seq",Vector,"Match Position","Match Region","Match %","SDR Match %","Intrinsic Score","Adjusted Score","Matches Other Gene in Same Taxon?","Orig. Target Gene ID","Orig. Target Gene Symbol","Forward Oligo Sequence","Reverse Oligo Sequence",Addgene
human,200316,APOBEC3F,NM_001006666.2,TRCN0000052127,NM_145298.3-367s1c1,CCATCCTTTCTCGTCGGAATA,pLKO.1,171,CDS,100,100,10.8,5.4,Y,200316,APOBEC3F,CCGGCCATCCTTTCTCGTCGGAATACTCGAGTATTCCGACGAGAAAGGATGGTTTTTG,AATTCAAAAACCATCCTTTCTCGTCGGAATACTCGAGTATTCCGACGAGAAAGGATGG,n/a
human,200316,APOBEC3F,NM_001006666.2,TRCN0000140591,NM_004900.3-84s1c1,GCGGATGTATCGAGACACATT,pLKO.1,127,CDS,95,95,,,Y,9582,APOBEC3B,CCGGGCGGATGTATCGAGACACATTCTCGAGAATGTGTCTCGATACATCCGCTTTTTG,AATTCAAAAAGCGGATGTATCGAGACACATTCTCGAGAATGTGTCTCGATACATCCGC,n/a
human,200316,APOBEC3F,NM_001006666.2,TRCN0000156754,NM_152426.1-59s1c1,GCGGATGTATCGAGACACATT,pLKO.1,127,CDS,95,95,,,Y,140564,APOBEC3D,CCGGGCGGATGTATCGAGACACATTCTCGAGAATGTGTCTCGATACATCCGCTTTTTG,AATTCAAAAAGCGGATGTATCGAGACACATTCTCGAGAATGTGTCTCGATACATCCGC,n/a
human,200316,APOBEC3F,NM_001006666.2,TRCN0000003195,NM_016542.x-1310s1c1,CTTAAACAGCAGGACGAGAAT,pLKO.1,552,3UTR,81,90,,,Y,51765,STK26,CCGGCTTAAACAGCAGGACGAGAATCTCGAGATTCTCGTCCTGCTGTTTAAGTTTTTG,AATTCAAAAACTTAAACAGCAGGACGAGAATCTCGAGATTCTCGTCCTGCTGTTTAAG,n/a
human,200316,APOBEC3F,NM_001006666.2,TRCN0000320668,NM_016542.3-1391s21c1,CTTAAACAGCAGGACGAGAAT,pLKO_005,552,3UTR,81,90,,,Y,51765,STK26,CCGGCTTAAACAGCAGGACGAGAATCTCGAGATTCTCGTCCTGCTGTTTAAGTTTTTG,AATTCAAAAACTTAAACAGCAGGACGAGAATCTCGAGATTCTCGTCCTGCTGTTTAAG,n/a
human,200316,APOBEC3F,NM_001006666.2,TRCN0000113262,NM_133835.1-529s1c1,GCTCCAGACAAAGATGCTATT,pLKO.1,58,5UTR,85,89,,,Y,98766,Ubac1,CCGGGCTCCAGACAAAGATGCTATTCTCGAGAATAGCATCTTTGTCTGGAGCTTTTTG,AATTCAAAAAGCTCCAGACAAAGATGCTATTCTCGAGAATAGCATCTTTGTCTGGAGC,n/a
human,200316,APOBEC3F,NM_001006666.2,TRCN0000325422,NM_133835.1-529s21c1,GCTCCAGACAAAGATGCTATT,pLKO_005,58,5UTR,85,89,,,Y,98766,Ubac1,CCGGGCTCCAGACAAAGATGCTATTCTCGAGAATAGCATCTTTGTCTGGAGCTTTTTG,AATTCAAAAAGCTCCAGACAAAGATGCTATTCTCGAGAATAGCATCTTTGTCTGGAGC,n/a
human,200316,APOBEC3F,NM_001006666.2,TRCN0000104049,NM_001024922.2-804s1c1,CCTTTGTATGATGCTTCGAAA,pLKO.1,538,3UTR,81,85,,,Y,234374,Ddx49,CCGGCCTTTGTATGATGCTTCGAAACTCGAGTTTCGAAGCATCATACAAAGGTTTTTG,AATTCAAAAACCTTTGTATGATGCTTCGAAACTCGAGTTTCGAAGCATCATACAAAGG,n/a
human,200316,APOBEC3F,NM_001006666.2,TRCN0000359171,NM_000540.2-1971s21c1,GCTCCAACCAAGATCTTATTA,pLKO_005,58,5UTR,81,85,,,Y,6261,RYR1,CCGGGCTCCAACCAAGATCTTATTACTCGAGTAATAAGATCTTGGTTGGAGCTTTTTG,AATTCAAAAAGCTCCAACCAAGATCTTATTACTCGAGTAATAAGATCTTGGTTGGAGC,n/a
human,200316,APOBEC3F,NM_001006666.2,TRCN0000265280,NM_153571.1-376s21c1,CCTGGTGAATGATGCCTATAA,pLKO_005,434,3UTR,81,85,,,Y,100900,Hscb,CCGGCCTGGTGAATGATGCCTATAACTCGAGTTATAGGCATCATTCACCAGGTTTTTG,AATTCAAAAACCTGGTGAATGATGCCTATAACTCGAGTTATAGGCATCATTCACCAGG,n/a
