Taxon,"Gene ID","Gene Symbol",Transcript,"Clone ID","Legacy Clone Name","Target Seq",Vector,"Match Position","Match Region","Match %","SDR Match %","Intrinsic Score","Adjusted Score","Matches Other Gene in Same Taxon?","Orig. Target Gene ID","Orig. Target Gene Symbol","Forward Oligo Sequence","Reverse Oligo Sequence",Addgene
human,1999,ELF3,XM_005244942.3,TRCN0000013867,NM_004433.3-3226s1c1,CAACTACTTCAGTGCGATGTA,pLKO.1,168,CDS,100,100,4.95,3.465,N,1999,ELF3,CCGGCAACTACTTCAGTGCGATGTACTCGAGTACATCGCACTGAAGTAGTTGTTTTTG,AATTCAAAAACAACTACTTCAGTGCGATGTACTCGAGTACATCGCACTGAAGTAGTTG,n/a
human,1999,ELF3,XM_005244942.3,TRCN0000054415,NM_007921.1-329s1c1,CCAAGTGGAGAAGAACAAGTA,pLKO.1,366,CDS,100,100,4.95,3.465,N,13710,Elf3,CCGGCCAAGTGGAGAAGAACAAGTACTCGAGTACTTGTTCTTCTCCACTTGGTTTTTG,AATTCAAAAACCAAGTGGAGAAGAACAAGTACTCGAGTACTTGTTCTTCTCCACTTGG,n/a
human,1999,ELF3,XM_005244942.3,TRCN0000013866,NM_004433.3-3582s1c1,GCTCTTCTGATGAGCTCAGTT,pLKO.1,524,CDS,100,100,4.95,2.97,N,1999,ELF3,CCGGGCTCTTCTGATGAGCTCAGTTCTCGAGAACTGAGCTCATCAGAAGAGCTTTTTG,AATTCAAAAAGCTCTTCTGATGAGCTCAGTTCTCGAGAACTGAGCTCATCAGAAGAGC,n/a
human,1999,ELF3,XM_005244942.3,TRCN0000178465,NM_178774.3-1068s1c1,GAGAAGCACAAGTACGATGAT,pLKO.1,373,CDS,80,89,,,N,320111,Prr18,CCGGGAGAAGCACAAGTACGATGATCTCGAGATCATCGTACTTGTGCTTCTCTTTTTG,AATTCAAAAAGAGAAGCACAAGTACGATGATCTCGAGATCATCGTACTTGTGCTTCTC,n/a
human,1999,ELF3,XM_005244942.3,TRCN0000087820,NM_016742.2-1026s1c1,GATCCCACTGATGCCAAGTAT,pLKO.1,886,3UTR,80,89,,,Y,12539,Cdc37,CCGGGATCCCACTGATGCCAAGTATCTCGAGATACTTGGCATCAGTGGGATCTTTTTG,AATTCAAAAAGATCCCACTGATGCCAAGTATCTCGAGATACTTGGCATCAGTGGGATC,n/a
human,1999,ELF3,XM_005244942.3,TRCN0000315590,NM_016742.4-1025s21c1,GATCCCACTGATGCCAAGTAT,pLKO_005,886,3UTR,80,89,,,Y,12539,Cdc37,CCGGGATCCCACTGATGCCAAGTATCTCGAGATACTTGGCATCAGTGGGATCTTTTTG,AATTCAAAAAGATCCCACTGATGCCAAGTATCTCGAGATACTTGGCATCAGTGGGATC,n/a
human,1999,ELF3,XM_005244942.3,TRCN0000135103,NM_015197.1-2918s1c1,CACCAAGGAGAAGAACAAGAA,pLKO.1,364,CDS,82,86,,,Y,23241,PACS2,CCGGCACCAAGGAGAAGAACAAGAACTCGAGTTCTTGTTCTTCTCCTTGGTGTTTTTG,AATTCAAAAACACCAAGGAGAAGAACAAGAACTCGAGTTCTTGTTCTTCTCCTTGGTG,n/a
human,1999,ELF3,XM_005244942.3,TRCN0000242878,NM_033377.1-325s21c1,GGCTGTGGAGAAGGAGGGCTG,pLKO_005,554,CDS,77,85,,,Y,114335,CGB1,CCGGGGCTGTGGAGAAGGAGGGCTGCTCGAGCAGCCCTCCTTCTCCACAGCCTTTTTG,AATTCAAAAAGGCTGTGGAGAAGGAGGGCTGCTCGAGCAGCCCTCCTTCTCCACAGCC,n/a
