Taxon,"Gene ID","Gene Symbol",Transcript,"Clone ID","Legacy Clone Name","Target Seq",Vector,"Match Position","Match Region","Match %","SDR Match %","Intrinsic Score","Adjusted Score","Matches Other Gene in Same Taxon?","Orig. Target Gene ID","Orig. Target Gene Symbol","Forward Oligo Sequence","Reverse Oligo Sequence",Addgene
human,744,MPPED2,XM_005253114.4,TRCN0000050749,NM_001584.1-582s1c1,CCTCCTGACAAACAGTATTTA,pLKO.1,898,CDS,100,100,15,10.5,N,744,MPPED2,CCGGCCTCCTGACAAACAGTATTTACTCGAGTAAATACTGTTTGTCAGGAGGTTTTTG,AATTCAAAAACCTCCTGACAAACAGTATTTACTCGAGTAAATACTGTTTGTCAGGAGG,n/a
human,744,MPPED2,XM_005253114.4,TRCN0000050750,NM_001584.1-398s1c1,CCTCAGAGGTTAAGAAGTTTA,pLKO.1,714,CDS,100,100,13.2,9.24,N,744,MPPED2,CCGGCCTCAGAGGTTAAGAAGTTTACTCGAGTAAACTTCTTAACCTCTGAGGTTTTTG,AATTCAAAAACCTCAGAGGTTAAGAAGTTTACTCGAGTAAACTTCTTAACCTCTGAGG,n/a
human,744,MPPED2,XM_005253114.4,TRCN0000050751,NM_001584.1-507s1c1,CCTTGTTAAACAGGACTACTA,pLKO.1,823,CDS,100,100,4.95,3.465,N,744,MPPED2,CCGGCCTTGTTAAACAGGACTACTACTCGAGTAGTAGTCCTGTTTAACAAGGTTTTTG,AATTCAAAAACCTTGTTAAACAGGACTACTACTCGAGTAGTAGTCCTGTTTAACAAGG,n/a
human,744,MPPED2,XM_005253114.4,TRCN0000362438,NM_011838.4-720s21c1,GAACTGATGGCATCCAGATAC,pLKO_005,642,CDS,85,89,,,N,23936,Lynx1,CCGGGAACTGATGGCATCCAGATACCTCGAGGTATCTGGATGCCATCAGTTCTTTTTG,AATTCAAAAAGAACTGATGGCATCCAGATACCTCGAGGTATCTGGATGCCATCAGTTC,n/a
human,744,MPPED2,XM_005253114.4,TRCN0000159663,NM_001010874.2-1094s1c1,GATGAGTATCCAGATGTCTTT,pLKO.1,647,CDS,85,89,,,Y,253017,TECRL,CCGGGATGAGTATCCAGATGTCTTTCTCGAGAAAGACATCTGGATACTCATCTTTTTG,AATTCAAAAAGATGAGTATCCAGATGTCTTTCTCGAGAAAGACATCTGGATACTCATC,n/a
human,744,MPPED2,XM_005253114.4,TRCN0000304000,NM_000276.3-3067s21c1,CAAGCCAAAGTTACCATATTT,pLKO_005,458,CDS,80,89,,,Y,4952,OCRL,CCGGCAAGCCAAAGTTACCATATTTCTCGAGAAATATGGTAACTTTGGCTTGTTTTTG,AATTCAAAAACAAGCCAAAGTTACCATATTTCTCGAGAAATATGGTAACTTTGGCTTG,n/a
human,744,MPPED2,XM_005253114.4,TRCN0000141233,NM_182525.1-455s1c1,CAGGAAAGAACTGCACAGCTT,pLKO.1,308,5UTR,80,89,,,Y,157376,FER1L6-AS2,CCGGCAGGAAAGAACTGCACAGCTTCTCGAGAAGCTGTGCAGTTCTTTCCTGTTTTTG,AATTCAAAAACAGGAAAGAACTGCACAGCTTCTCGAGAAGCTGTGCAGTTCTTTCCTG,n/a
human,744,MPPED2,XM_005253114.4,TRCN0000089404,NM_008386.2-114s1c1,GCCCAAACCCACCCAGGCTTT,pLKO.1,492,CDS,86,85,,,Y,16333,Ins1,CCGGGCCCAAACCCACCCAGGCTTTCTCGAGAAAGCCTGGGTGGGTTTGGGCTTTTTG,AATTCAAAAAGCCCAAACCCACCCAGGCTTTCTCGAGAAAGCCTGGGTGGGTTTGGGC,n/a
human,744,MPPED2,XM_005253114.4,TRCN0000413217,NM_028514.3-159s21c1,GACTCTGTAAAGTTGGAATTT,pLKO_005,393,5UTR,81,85,,,Y,73360,Actrt1,CCGGGACTCTGTAAAGTTGGAATTTCTCGAGAAATTCCAACTTTACAGAGTCTTTTTG,AATTCAAAAAGACTCTGTAAAGTTGGAATTTCTCGAGAAATTCCAACTTTACAGAGTC,n/a
human,744,MPPED2,XM_005253114.4,TRCN0000089407,NM_008386.2-112s1c1,GAGCCCAAACCCACCCAGGCT,pLKO.1,490,CDS,81,85,,,Y,16333,Ins1,CCGGGAGCCCAAACCCACCCAGGCTCTCGAGAGCCTGGGTGGGTTTGGGCTCTTTTTG,AATTCAAAAAGAGCCCAAACCCACCCAGGCTCTCGAGAGCCTGGGTGGGTTTGGGCTC,n/a
human,744,MPPED2,XM_005253114.4,TRCN0000127182,NM_025716.1-520s1c1,CCACACACTACAGACAGATTT,pLKO.1,630,CDS,77,85,,,Y,66701,Spryd4,CCGGCCACACACTACAGACAGATTTCTCGAGAAATCTGTCTGTAGTGTGTGGTTTTTG,AATTCAAAAACCACACACTACAGACAGATTTCTCGAGAAATCTGTCTGTAGTGTGTGG,n/a
