Taxon,"Gene ID","Gene Symbol",Transcript,"Clone ID","Legacy Clone Name","Target Seq",Vector,"Match Position","Match Region","Match %","SDR Match %","Intrinsic Score","Adjusted Score","Matches Other Gene in Same Taxon?","Orig. Target Gene ID","Orig. Target Gene Symbol","Forward Oligo Sequence","Reverse Oligo Sequence",Addgene
mouse,75593,Malsu1,XM_006506721.1,TRCN0000168429,NM_138446.1-354s1c1,GACATTTGTGTGATCCAGGTT,pLKO.1,370,CDS,100,100,2.64,1.848,N,115416,MALSU1,CCGGGACATTTGTGTGATCCAGGTTCTCGAGAACCTGGATCACACAAATGTCTTTTTG,AATTCAAAAAGACATTTGTGTGATCCAGGTTCTCGAGAACCTGGATCACACAAATGTC,n/a
mouse,75593,Malsu1,XM_006506721.1,TRCN0000172789,NM_138446.1-365s1c1,GATCCAGGTTCCTCCAGAAAT,pLKO.1,381,CDS,100,100,13.2,7.92,N,115416,MALSU1,CCGGGATCCAGGTTCCTCCAGAAATCTCGAGATTTCTGGAGGAACCTGGATCTTTTTG,AATTCAAAAAGATCCAGGTTCCTCCAGAAATCTCGAGATTTCTGGAGGAACCTGGATC,n/a
mouse,75593,Malsu1,XM_006506721.1,TRCN0000168507,NM_138446.1-572s1c1,GCTTCCAGAAACCAGAGAAAT,pLKO.1,588,CDS,95,100,13.2,9.24,N,115416,MALSU1,CCGGGCTTCCAGAAACCAGAGAAATCTCGAGATTTCTCTGGTTTCTGGAAGCTTTTTG,AATTCAAAAAGCTTCCAGAAACCAGAGAAATCTCGAGATTTCTCTGGTTTCTGGAAGC,n/a
mouse,75593,Malsu1,XM_006506721.1,TRCN0000113776,NM_178546.2-820s1c1,GCAGCTGAGATGTTCCTGAAA,pLKO.1,667,CDS,86,90,,,Y,339483,MTMR9LP,CCGGGCAGCTGAGATGTTCCTGAAACTCGAGTTTCAGGAACATCTCAGCTGCTTTTTG,AATTCAAAAAGCAGCTGAGATGTTCCTGAAACTCGAGTTTCAGGAACATCTCAGCTGC,n/a
mouse,75593,Malsu1,XM_006506721.1,TRCN0000420700,NM_138446.1-661s21c1,CAGTACCTGAAGACTTCATTC,pLKO_005,677,CDS,90,89,,,Y,115416,MALSU1,CCGGCAGTACCTGAAGACTTCATTCCTCGAGGAATGAAGTCTTCAGGTACTGTTTTTG,AATTCAAAAACAGTACCTGAAGACTTCATTCCTCGAGGAATGAAGTCTTCAGGTACTG,n/a
mouse,75593,Malsu1,XM_006506721.1,TRCN0000356149,NM_032387.3-542s21c1,TCAAGTTTGACATCGAGATTG,pLKO_005,317,CDS,80,89,,,Y,65266,WNK4,CCGGTCAAGTTTGACATCGAGATTGCTCGAGCAATCTCGATGTCAAACTTGATTTTTG,AATTCAAAAATCAAGTTTGACATCGAGATTGCTCGAGCAATCTCGATGTCAAACTTGA,n/a
mouse,75593,Malsu1,XM_006506721.1,TRCN0000245989,NM_001039165.2-448s21c1,GCTGCTCAGCTCCAATGTCTA,pLKO_005,872,CDS,77,85,,,Y,116534,MRGPRE,CCGGGCTGCTCAGCTCCAATGTCTACTCGAGTAGACATTGGAGCTGAGCAGCTTTTTG,AATTCAAAAAGCTGCTCAGCTCCAATGTCTACTCGAGTAGACATTGGAGCTGAGCAGC,n/a
mouse,75593,Malsu1,XM_006506721.1,TRCN0000217285,NM_001002777.1-1586s1c1,GTGTGGACTTAGGAGTATTTA,pLKO.1,554,CDS,77,85,,,Y,442813,9430025C20Rik,CCGGGTGTGGACTTAGGAGTATTTACTCGAGTAAATACTCCTAAGTCCACACTTTTTG,AATTCAAAAAGTGTGGACTTAGGAGTATTTACTCGAGTAAATACTCCTAAGTCCACAC,n/a
