Taxon,"Gene ID","Gene Symbol",Transcript,"Clone ID","Legacy Clone Name","Target Seq",Vector,"Match Position","Match Region","Match %","SDR Match %","Intrinsic Score","Adjusted Score","Matches Other Gene in Same Taxon?","Orig. Target Gene ID","Orig. Target Gene Symbol","Forward Oligo Sequence","Reverse Oligo Sequence",Addgene
mouse,69809,1810046K07Rik,XM_006510587.1,TRCN0000341234,NM_027217.1-536s21c1,ACCCAACTCATTTCGTCTTTA,pLKO_005,550,CDS,100,100,13.2,9.24,N,69809,1810046K07Rik,CCGGACCCAACTCATTTCGTCTTTACTCGAGTAAAGACGAAATGAGTTGGGTTTTTTG,AATTCAAAAAACCCAACTCATTTCGTCTTTACTCGAGTAAAGACGAAATGAGTTGGGT,n/a
mouse,69809,1810046K07Rik,XM_006510587.1,TRCN0000341168,NM_027217.1-969s21c1,GAGGACTTCTGCATCCTTATA,pLKO_005,983,3UTR,100,100,13.2,9.24,N,69809,1810046K07Rik,CCGGGAGGACTTCTGCATCCTTATACTCGAGTATAAGGATGCAGAAGTCCTCTTTTTG,AATTCAAAAAGAGGACTTCTGCATCCTTATACTCGAGTATAAGGATGCAGAAGTCCTC,n/a
mouse,69809,1810046K07Rik,XM_006510587.1,TRCN0000341164,NM_027217.1-803s21c1,CTTTCATGACAGTGTCAAATG,pLKO_005,817,CDS,100,100,10.8,7.56,N,69809,1810046K07Rik,CCGGCTTTCATGACAGTGTCAAATGCTCGAGCATTTGACACTGTCATGAAAGTTTTTG,AATTCAAAAACTTTCATGACAGTGTCAAATGCTCGAGCATTTGACACTGTCATGAAAG,n/a
mouse,69809,1810046K07Rik,XM_006510587.1,TRCN0000341165,NM_027217.1-291s21c1,GAGATCCTTCCTGTCCGATTC,pLKO_005,305,CDS,100,100,6,4.2,N,69809,1810046K07Rik,CCGGGAGATCCTTCCTGTCCGATTCCTCGAGGAATCGGACAGGAAGGATCTCTTTTTG,AATTCAAAAAGAGATCCTTCCTGTCCGATTCCTCGAGGAATCGGACAGGAAGGATCTC,n/a
mouse,69809,1810046K07Rik,XM_006510587.1,TRCN0000341167,NM_027217.1-323s21c1,GCAGCAAACAGTTCTCGAATG,pLKO_005,337,CDS,100,100,6,4.2,N,69809,1810046K07Rik,CCGGGCAGCAAACAGTTCTCGAATGCTCGAGCATTCGAGAACTGTTTGCTGCTTTTTG,AATTCAAAAAGCAGCAAACAGTTCTCGAATGCTCGAGCATTCGAGAACTGTTTGCTGC,n/a
mouse,69809,1810046K07Rik,XM_006510587.1,TRCN0000166166,NM_198498.1-236s1c1,CAAATGACGTCTACACCTCCA,pLKO.1,352,CDS,85,89,,,N,341032,C11orf53,CCGGCAAATGACGTCTACACCTCCACTCGAGTGGAGGTGTAGACGTCATTTGTTTTTG,AATTCAAAAACAAATGACGTCTACACCTCCACTCGAGTGGAGGTGTAGACGTCATTTG,n/a
mouse,69809,1810046K07Rik,XM_006510587.1,TRCN0000021033,NM_199244.1-246s1c1,CCCTTCAGAGTTTGGCACCAA,pLKO.1,634,CDS,85,89,,,N,349334,FOXD4L4,CCGGCCCTTCAGAGTTTGGCACCAACTCGAGTTGGTGCCAAACTCTGAAGGGTTTTTG,AATTCAAAAACCCTTCAGAGTTTGGCACCAACTCGAGTTGGTGCCAAACTCTGAAGGG,n/a
mouse,69809,1810046K07Rik,XM_006510587.1,TRCN0000036503,NM_005731.2-210s1c1,TCAAATCCTAATGGAGACAAA,pLKO.1,1179,3UTR,85,89,,,Y,10109,ARPC2,CCGGTCAAATCCTAATGGAGACAAACTCGAGTTTGTCTCCATTAGGATTTGATTTTTG,AATTCAAAAATCAAATCCTAATGGAGACAAACTCGAGTTTGTCTCCATTAGGATTTGA,n/a
mouse,69809,1810046K07Rik,XM_006510587.1,TRCN0000307240,NM_005731.2-210s21c1,TCAAATCCTAATGGAGACAAA,pLKO_005,1179,3UTR,85,89,,,Y,10109,ARPC2,CCGGTCAAATCCTAATGGAGACAAACTCGAGTTTGTCTCCATTAGGATTTGATTTTTG,AATTCAAAAATCAAATCCTAATGGAGACAAACTCGAGTTTGTCTCCATTAGGATTTGA,n/a
mouse,69809,1810046K07Rik,XM_006510587.1,TRCN0000098039,NM_007879.1-537s1c1,CCTTGGGACATAAGAAGATAA,pLKO.1,909,CDS,80,89,,,Y,13494,Drg1,CCGGCCTTGGGACATAAGAAGATAACTCGAGTTATCTTCTTATGTCCCAAGGTTTTTG,AATTCAAAAACCTTGGGACATAAGAAGATAACTCGAGTTATCTTCTTATGTCCCAAGG,n/a
mouse,69809,1810046K07Rik,XM_006510587.1,TRCN0000064242,NM_022463.3-734s1c1,CCTGGTGGAATCCTACCGGAA,pLKO.1,425,CDS,80,89,,,Y,64359,NXN,CCGGCCTGGTGGAATCCTACCGGAACTCGAGTTCCGGTAGGATTCCACCAGGTTTTTG,AATTCAAAAACCTGGTGGAATCCTACCGGAACTCGAGTTCCGGTAGGATTCCACCAGG,n/a
mouse,69809,1810046K07Rik,XM_006510587.1,TRCN0000062002,NM_000917.1-1628s1c1,CCAGTGCTAGTTGGCAACAAA,pLKO.1,1088,3UTR,80,89,,,Y,5033,P4HA1,CCGGCCAGTGCTAGTTGGCAACAAACTCGAGTTTGTTGCCAACTAGCACTGGTTTTTG,AATTCAAAAACCAGTGCTAGTTGGCAACAAACTCGAGTTTGTTGCCAACTAGCACTGG,n/a
mouse,69809,1810046K07Rik,XM_006510587.1,TRCN0000300172,NM_000917.3-1751s21c1,CCAGTGCTAGTTGGCAACAAA,pLKO_005,1088,3UTR,80,89,,,Y,5033,P4HA1,CCGGCCAGTGCTAGTTGGCAACAAACTCGAGTTTGTTGCCAACTAGCACTGGTTTTTG,AATTCAAAAACCAGTGCTAGTTGGCAACAAACTCGAGTTTGTTGCCAACTAGCACTGG,n/a
mouse,69809,1810046K07Rik,XM_006510587.1,TRCN0000078017,NM_006249.3-849s1c1,CCTTCACAAGGAGGCAACAAA,pLKO.1,1198,3UTR,80,89,,,Y,5544,PRB3,CCGGCCTTCACAAGGAGGCAACAAACTCGAGTTTGTTGCCTCCTTGTGAAGGTTTTTG,AATTCAAAAACCTTCACAAGGAGGCAACAAACTCGAGTTTGTTGCCTCCTTGTGAAGG,n/a
mouse,69809,1810046K07Rik,XM_006510587.1,TRCN0000128892,NM_182500.1-546s1c1,GATTCAGAACTGGAGTTTCCT,pLKO.1,1050,3UTR,80,89,,,Y,130813,C2orf50,CCGGGATTCAGAACTGGAGTTTCCTCTCGAGAGGAAACTCCAGTTCTGAATCTTTTTG,AATTCAAAAAGATTCAGAACTGGAGTTTCCTCTCGAGAGGAAACTCCAGTTCTGAATC,n/a
mouse,69809,1810046K07Rik,XM_006510587.1,TRCN0000415233,NM_032859.2-475s21c1,GCCATCCTCTTCACGTCTTTA,pLKO_005,800,CDS,81,85,,,Y,84945,ABHD13,CCGGGCCATCCTCTTCACGTCTTTACTCGAGTAAAGACGTGAAGAGGATGGCTTTTTG,AATTCAAAAAGCCATCCTCTTCACGTCTTTACTCGAGTAAAGACGTGAAGAGGATGGC,n/a
mouse,69809,1810046K07Rik,XM_006510587.1,TRCN0000087445,XM_357876.1-62s1c1,AGATGCTCTTCTCTGCATATT,pLKO.1,881,CDS,81,85,,,Y,384814,Gm5347,CCGGAGATGCTCTTCTCTGCATATTCTCGAGAATATGCAGAGAAGAGCATCTTTTTTG,AATTCAAAAAAGATGCTCTTCTCTGCATATTCTCGAGAATATGCAGAGAAGAGCATCT,n/a
mouse,69809,1810046K07Rik,XM_006510587.1,TRCN0000087622,XM_489905.1-403s1c1,CCCTTTCTTATGCACTGTGTT,pLKO.1,1115,3UTR,77,85,,,Y,436569,LOC436569,CCGGCCCTTTCTTATGCACTGTGTTCTCGAGAACACAGTGCATAAGAAAGGGTTTTTG,AATTCAAAAACCCTTTCTTATGCACTGTGTTCTCGAGAACACAGTGCATAAGAAAGGG,n/a
mouse,69809,1810046K07Rik,XM_006510587.1,TRCN0000117123,NM_007203.3-2386s1c1,GCATCCAATGAGACAACCAAT,pLKO.1,1181,3UTR,77,85,,,Y,445815,PALM2AKAP2,CCGGGCATCCAATGAGACAACCAATCTCGAGATTGGTTGTCTCATTGGATGCTTTTTG,AATTCAAAAAGCATCCAATGAGACAACCAATCTCGAGATTGGTTGTCTCATTGGATGC,n/a
mouse,69809,1810046K07Rik,XM_006510587.1,TRCN0000153143,NM_001004065.2-1784s1c1,GCATCCAATGAGACAACCAAT,pLKO.1,1181,3UTR,77,85,,,Y,,,CCGGGCATCCAATGAGACAACCAATCTCGAGATTGGTTGTCTCATTGGATGCTTTTTG,AATTCAAAAAGCATCCAATGAGACAACCAATCTCGAGATTGGTTGTCTCATTGGATGC,n/a
