Taxon,"Gene ID","Gene Symbol",Transcript,"Clone ID","Legacy Clone Name","Target Seq",Vector,"Match Position","Match Region","Match %","SDR Match %","Intrinsic Score","Adjusted Score","Matches Other Gene in Same Taxon?","Orig. Target Gene ID","Orig. Target Gene Symbol","Forward Oligo Sequence","Reverse Oligo Sequence",Addgene
mouse,12040,Bckdhb,XM_006510786.1,TRCN0000339110,NM_199195.1-378s21c1,ATCCAGTTTGCCGACTATATT,pLKO_005,345,CDS,100,100,15,21,N,12040,Bckdhb,CCGGATCCAGTTTGCCGACTATATTCTCGAGAATATAGTCGGCAAACTGGATTTTTTG,AATTCAAAAAATCCAGTTTGCCGACTATATTCTCGAGAATATAGTCGGCAAACTGGAT,n/a
mouse,12040,Bckdhb,XM_006510786.1,TRCN0000339175,NM_199195.1-1096s21c1,TTCGCAAGATGATCAACTATT,pLKO_005,1063,CDS,100,100,13.2,18.48,N,12040,Bckdhb,CCGGTTCGCAAGATGATCAACTATTCTCGAGAATAGTTGATCATCTTGCGAATTTTTG,AATTCAAAAATTCGCAAGATGATCAACTATTCTCGAGAATAGTTGATCATCTTGCGAA,n/a
mouse,12040,Bckdhb,XM_006510786.1,TRCN0000041398,NM_199195.1-1219s1c1,GCAACGAACTGTCATGGATAT,pLKO.1,1186,3UTR,100,100,10.8,8.64,N,12040,Bckdhb,CCGGGCAACGAACTGTCATGGATATCTCGAGATATCCATGACAGTTCGTTGCTTTTTG,AATTCAAAAAGCAACGAACTGTCATGGATATCTCGAGATATCCATGACAGTTCGTTGC,n/a
mouse,12040,Bckdhb,XM_006510786.1,TRCN0000374433,NM_199195.1-1141s21c1,CATGACCAGACATGGAAATAT,pLKO_005,1108,3UTR,100,100,15,10.5,N,12040,Bckdhb,CCGGCATGACCAGACATGGAAATATCTCGAGATATTTCCATGTCTGGTCATGTTTTTG,AATTCAAAAACATGACCAGACATGGAAATATCTCGAGATATTTCCATGTCTGGTCATG,n/a
mouse,12040,Bckdhb,XM_006510786.1,TRCN0000041401,NM_199195.1-561s1c1,CCAGGGATCAAGGTGGTAATA,pLKO.1,528,CDS,100,100,13.2,9.24,N,12040,Bckdhb,CCGGCCAGGGATCAAGGTGGTAATACTCGAGTATTACCACCTTGATCCCTGGTTTTTG,AATTCAAAAACCAGGGATCAAGGTGGTAATACTCGAGTATTACCACCTTGATCCCTGG,n/a
mouse,12040,Bckdhb,XM_006510786.1,TRCN0000339109,NM_199195.1-840s21c1,GTCATCGATCTGCGGACAATT,pLKO_005,807,CDS,100,100,13.2,9.24,N,12040,Bckdhb,CCGGGTCATCGATCTGCGGACAATTCTCGAGAATTGTCCGCAGATCGATGACTTTTTG,AATTCAAAAAGTCATCGATCTGCGGACAATTCTCGAGAATTGTCCGCAGATCGATGAC,n/a
mouse,12040,Bckdhb,XM_006510786.1,TRCN0000374434,NM_199195.1-421s21c1,TCAACGAAGCTGCCAAGTATC,pLKO_005,388,CDS,100,100,10.8,7.56,N,12040,Bckdhb,CCGGTCAACGAAGCTGCCAAGTATCCTCGAGGATACTTGGCAGCTTCGTTGATTTTTG,AATTCAAAAATCAACGAAGCTGCCAAGTATCCTCGAGGATACTTGGCAGCTTCGTTGA,n/a
mouse,12040,Bckdhb,XM_006510786.1,TRCN0000339112,NM_199195.1-352s21c1,TCACCGGTGCTACAGCTATTG,pLKO_005,319,CDS,100,100,10.8,7.56,N,12040,Bckdhb,CCGGTCACCGGTGCTACAGCTATTGCTCGAGCAATAGCTGTAGCACCGGTGATTTTTG,AATTCAAAAATCACCGGTGCTACAGCTATTGCTCGAGCAATAGCTGTAGCACCGGTGA,n/a
mouse,12040,Bckdhb,XM_006510786.1,TRCN0000041402,NM_199195.1-974s1c1,CCAGGAAGAATGTTTCTTGAA,pLKO.1,941,CDS,100,100,4.95,3.465,N,12040,Bckdhb,CCGGCCAGGAAGAATGTTTCTTGAACTCGAGTTCAAGAAACATTCTTCCTGGTTTTTG,AATTCAAAAACCAGGAAGAATGTTTCTTGAACTCGAGTTCAAGAAACATTCTTCCTGG,n/a
mouse,12040,Bckdhb,XM_006510786.1,TRCN0000041400,NM_199195.1-1041s1c1,CCTCACATCTTTGAGCCCTTT,pLKO.1,1008,CDS,100,100,4.05,2.835,N,12040,Bckdhb,CCGGCCTCACATCTTTGAGCCCTTTCTCGAGAAAGGGCTCAAAGATGTGAGGTTTTTG,AATTCAAAAACCTCACATCTTTGAGCCCTTTCTCGAGAAAGGGCTCAAAGATGTGAGG,n/a
mouse,12040,Bckdhb,XM_006510786.1,TRCN0000236121,NM_183050.2-1120s21c1,GAACCTAGAGGCTCCTATATC,pLKO_005,959,CDS,95,95,,,N,594,BCKDHB,CCGGGAACCTAGAGGCTCCTATATCCTCGAGGATATAGGAGCCTCTAGGTTCTTTTTG,AATTCAAAAAGAACCTAGAGGCTCCTATATCCTCGAGGATATAGGAGCCTCTAGGTTC,n/a
mouse,12040,Bckdhb,XM_006510786.1,TRCN0000028468,NM_183050.1-1086s1c1,GAGGAATGTTTCTTGAACCTA,pLKO.1,945,CDS,95,95,,,N,594,BCKDHB,CCGGGAGGAATGTTTCTTGAACCTACTCGAGTAGGTTCAAGAAACATTCCTCTTTTTG,AATTCAAAAAGAGGAATGTTTCTTGAACCTACTCGAGTAGGTTCAAGAAACATTCCTC,n/a
mouse,12040,Bckdhb,XM_006510786.1,TRCN0000441476,NM_006866.2-1457s21c1,CCAGAGAAGCCTACAAGATGC,pLKO_005,660,CDS,86,90,,,Y,11027,LILRA2,CCGGCCAGAGAAGCCTACAAGATGCCTCGAGGCATCTTGTAGGCTTCTCTGGTTTTTG,AATTCAAAAACCAGAGAAGCCTACAAGATGCCTCGAGGCATCTTGTAGGCTTCTCTGG,n/a
mouse,12040,Bckdhb,XM_006510786.1,TRCN0000028438,NM_183050.1-972s1c1,CCTTGGGATGTGGACACAATT,pLKO.1,831,CDS,90,89,,,Y,594,BCKDHB,CCGGCCTTGGGATGTGGACACAATTCTCGAGAATTGTGTCCACATCCCAAGGTTTTTG,AATTCAAAAACCTTGGGATGTGGACACAATTCTCGAGAATTGTGTCCACATCCCAAGG,n/a
mouse,12040,Bckdhb,XM_006510786.1,TRCN0000236122,NM_183050.2-488s21c1,GCTACTGCCATTGCGGAAATT,pLKO_005,327,CDS,85,89,,,N,594,BCKDHB,CCGGGCTACTGCCATTGCGGAAATTCTCGAGAATTTCCGCAATGGCAGTAGCTTTTTG,AATTCAAAAAGCTACTGCCATTGCGGAAATTCTCGAGAATTTCCGCAATGGCAGTAGC,n/a
mouse,12040,Bckdhb,XM_006510786.1,TRCN0000339310,NM_029846.3-1669s21c1,GTCATCGACCTCCGGACAAAT,pLKO_005,807,CDS,85,89,,,Y,77040,Atg16l1,CCGGGTCATCGACCTCCGGACAAATCTCGAGATTTGTCCGGAGGTCGATGACTTTTTG,AATTCAAAAAGTCATCGACCTCCGGACAAATCTCGAGATTTGTCCGGAGGTCGATGAC,n/a
mouse,12040,Bckdhb,XM_006510786.1,TRCN0000236118,NM_183050.2-1233s21c1,TGATCAACTATTGACCATATA,pLKO_005,1072,CDS,85,89,,,Y,594,BCKDHB,CCGGTGATCAACTATTGACCATATACTCGAGTATATGGTCAATAGTTGATCATTTTTG,AATTCAAAAATGATCAACTATTGACCATATACTCGAGTATATGGTCAATAGTTGATCA,n/a
mouse,12040,Bckdhb,XM_006510786.1,TRCN0000028459,NM_183050.1-481s1c1,CGGAAATTCAGTTTGCAGATT,pLKO.1,340,CDS,85,89,,,Y,594,BCKDHB,CCGGCGGAAATTCAGTTTGCAGATTCTCGAGAATCTGCAAACTGAATTTCCGTTTTTG,AATTCAAAAACGGAAATTCAGTTTGCAGATTCTCGAGAATCTGCAAACTGAATTTCCG,n/a
mouse,12040,Bckdhb,XM_006510786.1,TRCN0000583962,,GCTTCCATGGCCCAAGTATTT,pLKO_005,768,CDS,80,89,,,N,403282,OR6C65,CCGGGCTTCCATGGCCCAAGTATTTCTCGAGAAATACTTGGGCCATGGAAGCTTTTTG,AATTCAAAAAGCTTCCATGGCCCAAGTATTTCTCGAGAAATACTTGGGCCATGGAAGC,n/a
mouse,12040,Bckdhb,XM_006510786.1,TRCN0000044375,NM_014854.1-1059s1c1,GCCACTGAGATCAGCTTCAAT,pLKO.1,918,CDS,80,89,,,Y,9906,SLC35E2A,CCGGGCCACTGAGATCAGCTTCAATCTCGAGATTGAAGCTGATCTCAGTGGCTTTTTG,AATTCAAAAAGCCACTGAGATCAGCTTCAATCTCGAGATTGAAGCTGATCTCAGTGGC,n/a
mouse,12040,Bckdhb,XM_006510786.1,TRCN0000204117,NM_146556.1-289s1c1,GCTCAGGTGTTCTTCTTCATA,pLKO.1,415,CDS,80,89,,,Y,258549,Olfr798,CCGGGCTCAGGTGTTCTTCTTCATACTCGAGTATGAAGAAGAACACCTGAGCTTTTTG,AATTCAAAAAGCTCAGGTGTTCTTCTTCATACTCGAGTATGAAGAAGAACACCTGAGC,n/a
mouse,12040,Bckdhb,XM_006510786.1,TRCN0000381955,NM_004603.2-555s21c1,CTTTGCCTCTGGGATCATCAT,pLKO_005,914,CDS,80,89,,,Y,6804,STX1A,CCGGCTTTGCCTCTGGGATCATCATCTCGAGATGATGATCCCAGAGGCAAAGTTTTTG,AATTCAAAAACTTTGCCTCTGGGATCATCATCTCGAGATGATGATCCCAGAGGCAAAG,n/a
mouse,12040,Bckdhb,XM_006510786.1,TRCN0000230582,NM_178457.1-4176s21c1,ACGAACTGTGAAGGATATTTC,pLKO_005,1189,3UTR,80,89,,,Y,128611,ZNF831,CCGGACGAACTGTGAAGGATATTTCCTCGAGGAAATATCCTTCACAGTTCGTTTTTTG,AATTCAAAAAACGAACTGTGAAGGATATTTCCTCGAGGAAATATCCTTCACAGTTCGT,n/a
mouse,12040,Bckdhb,XM_006510786.1,TRCN0000142598,NM_001017435.1-681s1c1,GAAATGCTTGAAGGAGTGCAA,pLKO.1,1265,3UTR,80,89,,,Y,441519,CT45A3,CCGGGAAATGCTTGAAGGAGTGCAACTCGAGTTGCACTCCTTCAAGCATTTCTTTTTG,AATTCAAAAAGAAATGCTTGAAGGAGTGCAACTCGAGTTGCACTCCTTCAAGCATTTC,n/a
mouse,12040,Bckdhb,XM_006510786.1,TRCN0000149280,NM_152582.3-681s1c1,GAAATGCTTGAAGGAGTGCAA,pLKO.1,1265,3UTR,80,89,,,Y,728911,CT45A2,CCGGGAAATGCTTGAAGGAGTGCAACTCGAGTTGCACTCCTTCAAGCATTTCTTTTTG,AATTCAAAAAGAAATGCTTGAAGGAGTGCAACTCGAGTTGCACTCCTTCAAGCATTTC,n/a
mouse,12040,Bckdhb,XM_006510786.1,TRCN0000161235,NM_001007551.1-526s1c1,GAAATGCTTGAAGGAGTGCAA,pLKO.1,1265,3UTR,80,89,,,Y,441521,CT45A5,CCGGGAAATGCTTGAAGGAGTGCAACTCGAGTTGCACTCCTTCAAGCATTTCTTTTTG,AATTCAAAAAGAAATGCTTGAAGGAGTGCAACTCGAGTTGCACTCCTTCAAGCATTTC,n/a
mouse,12040,Bckdhb,XM_006510786.1,TRCN0000155107,NM_030754.2-153s1c1,GAAGCCAATTACATCGGCTCA,pLKO.1,1344,3UTR,86,85,,,Y,6289,SAA2,CCGGGAAGCCAATTACATCGGCTCACTCGAGTGAGCCGATGTAATTGGCTTCTTTTTG,AATTCAAAAAGAAGCCAATTACATCGGCTCACTCGAGTGAGCCGATGTAATTGGCTTC,n/a
mouse,12040,Bckdhb,XM_006510786.1,TRCN0000137306,NM_014583.2-402s1c1,GAACCGGATGATCATGACCAA,pLKO.1,1095,3UTR,81,85,,,Y,29995,LMCD1,CCGGGAACCGGATGATCATGACCAACTCGAGTTGGTCATGATCATCCGGTTCTTTTTG,AATTCAAAAAGAACCGGATGATCATGACCAACTCGAGTTGGTCATGATCATCCGGTTC,n/a
mouse,12040,Bckdhb,XM_006510786.1,TRCN0000151500,NM_207352.1-204s1c1,CATTGAGTACACAGAGGAATA,pLKO.1,1249,3UTR,81,85,,,Y,285440,CYP4V2,CCGGCATTGAGTACACAGAGGAATACTCGAGTATTCCTCTGTGTACTCAATGTTTTTG,AATTCAAAAACATTGAGTACACAGAGGAATACTCGAGTATTCCTCTGTGTACTCAATG,n/a
