Taxon,"Gene ID","Gene Symbol",Transcript,"Clone ID","Legacy Clone Name","Target Seq",Vector,"Match Position","Match Region","Match %","SDR Match %","Intrinsic Score","Adjusted Score","Matches Other Gene in Same Taxon?","Orig. Target Gene ID","Orig. Target Gene Symbol","Forward Oligo Sequence","Reverse Oligo Sequence",Addgene
mouse,72745,Tmem161b,XM_006517403.3,TRCN0000179003,NM_175187.3-1333s1c1,CCCTTGCCAGTGGATAATAAT,pLKO.1,1143,CDS,100,100,15,10.5,N,72745,Tmem161b,CCGGCCCTTGCCAGTGGATAATAATCTCGAGATTATTATCCACTGGCAAGGGTTTTTG,AATTCAAAAACCCTTGCCAGTGGATAATAATCTCGAGATTATTATCCACTGGCAAGGG,n/a
mouse,72745,Tmem161b,XM_006517403.3,TRCN0000178795,NM_175187.3-398s1c1,CACTGCATTACTTCCCAGAAT,pLKO.1,246,5UTR,100,100,4.95,3.465,N,72745,Tmem161b,CCGGCACTGCATTACTTCCCAGAATCTCGAGATTCTGGGAAGTAATGCAGTGTTTTTG,AATTCAAAAACACTGCATTACTTCCCAGAATCTCGAGATTCTGGGAAGTAATGCAGTG,n/a
mouse,72745,Tmem161b,XM_006517403.3,TRCN0000167747,NM_153354.2-179s1c1,GCAGAAGATTATACCTCACTA,pLKO.1,10,5UTR,100,100,4.95,3.465,N,153396,TMEM161B,CCGGGCAGAAGATTATACCTCACTACTCGAGTAGTGAGGTATAATCTTCTGCTTTTTG,AATTCAAAAAGCAGAAGATTATACCTCACTACTCGAGTAGTGAGGTATAATCTTCTGC,n/a
mouse,72745,Tmem161b,XM_006517403.3,TRCN0000184313,NM_175187.3-397s1c1,GCACTGCATTACTTCCCAGAA,pLKO.1,245,5UTR,100,100,4.05,2.835,N,72745,Tmem161b,CCGGGCACTGCATTACTTCCCAGAACTCGAGTTCTGGGAAGTAATGCAGTGCTTTTTG,AATTCAAAAAGCACTGCATTACTTCCCAGAACTCGAGTTCTGGGAAGTAATGCAGTGC,n/a
mouse,72745,Tmem161b,XM_006517403.3,TRCN0000183453,NM_175187.3-448s1c1,GCTACCATTGTCTATTTAGTA,pLKO.1,296,5UTR,100,100,5.625,3.375,N,72745,Tmem161b,CCGGGCTACCATTGTCTATTTAGTACTCGAGTACTAAATAGACAATGGTAGCTTTTTG,AATTCAAAAAGCTACCATTGTCTATTTAGTACTCGAGTACTAAATAGACAATGGTAGC,n/a
mouse,72745,Tmem161b,XM_006517403.3,TRCN0000168156,NM_153354.2-1063s1c1,CTCTGCGACTCTGGTTAATAA,pLKO.1,856,CDS,95,95,,,N,153396,TMEM161B,CCGGCTCTGCGACTCTGGTTAATAACTCGAGTTATTAACCAGAGTCGCAGAGTTTTTG,AATTCAAAAACTCTGCGACTCTGGTTAATAACTCGAGTTATTAACCAGAGTCGCAGAG,n/a
mouse,72745,Tmem161b,XM_006517403.3,TRCN0000422834,NM_145046.3-1176s21c1,CGAACATTACTTCAATCAATT,pLKO_005,717,CDS,86,90,,,N,125972,CALR3,CCGGCGAACATTACTTCAATCAATTCTCGAGAATTGATTGAAGTAATGTTCGTTTTTG,AATTCAAAAACGAACATTACTTCAATCAATTCTCGAGAATTGATTGAAGTAATGTTCG,n/a
mouse,72745,Tmem161b,XM_006517403.3,TRCN0000172896,NM_153354.2-168s1c1,GCCAGTGTCATGCAGAAGATT,pLKO.1,1,5UTR,90,89,,,N,153396,TMEM161B,CCGGGCCAGTGTCATGCAGAAGATTCTCGAGAATCTTCTGCATGACACTGGCTTTTTG,AATTCAAAAAGCCAGTGTCATGCAGAAGATTCTCGAGAATCTTCTGCATGACACTGGC,n/a
mouse,72745,Tmem161b,XM_006517403.3,TRCN0000421604,NM_004979.4-3641s21c1,TGCAATGGAGTTTCATGAAAT,pLKO_005,539,CDS,85,89,,,Y,3750,KCND1,CCGGTGCAATGGAGTTTCATGAAATCTCGAGATTTCATGAAACTCCATTGCATTTTTG,AATTCAAAAATGCAATGGAGTTTCATGAAATCTCGAGATTTCATGAAACTCCATTGCA,n/a
mouse,72745,Tmem161b,XM_006517403.3,TRCN0000044326,NM_012128.2-1099s1c1,GCCACTATTGTAAATAAGCTA,pLKO.1,159,5UTR,85,89,,,Y,22802,CLCA4,CCGGGCCACTATTGTAAATAAGCTACTCGAGTAGCTTATTTACAATAGTGGCTTTTTG,AATTCAAAAAGCCACTATTGTAAATAAGCTACTCGAGTAGCTTATTTACAATAGTGGC,n/a
mouse,72745,Tmem161b,XM_006517403.3,TRCN0000141010,NM_014287.2-633s1c1,CCTCATAGTTGCTGGCTACAA,pLKO.1,1755,3UTR,85,89,,,Y,23420,NOMO1,CCGGCCTCATAGTTGCTGGCTACAACTCGAGTTGTAGCCAGCAACTATGAGGTTTTTG,AATTCAAAAACCTCATAGTTGCTGGCTACAACTCGAGTTGTAGCCAGCAACTATGAGG,n/a
mouse,72745,Tmem161b,XM_006517403.3,TRCN0000347074,NM_001163528.1-1706s21c1,CAGTGGCTGGAGGACTTTAAT,pLKO_005,269,5UTR,80,89,,,Y,73338,Itpripl1,CCGGCAGTGGCTGGAGGACTTTAATCTCGAGATTAAAGTCCTCCAGCCACTGTTTTTG,AATTCAAAAACAGTGGCTGGAGGACTTTAATCTCGAGATTAAAGTCCTCCAGCCACTG,n/a
mouse,72745,Tmem161b,XM_006517403.3,TRCN0000191209,NM_026543.1-662s1c1,CAAGTCCTGTTACACAAGTTA,pLKO.1,217,5UTR,80,89,,,Y,68067,Mrnip,CCGGCAAGTCCTGTTACACAAGTTACTCGAGTAACTTGTGTAACAGGACTTGTTTTTG,AATTCAAAAACAAGTCCTGTTACACAAGTTACTCGAGTAACTTGTGTAACAGGACTTG,n/a
mouse,72745,Tmem161b,XM_006517403.3,TRCN0000278931,NM_153713.1-600s21c1,GAACATCCTTCCCGAAGAATC,pLKO_005,77,5UTR,80,89,,,Y,128077,LIX1L,CCGGGAACATCCTTCCCGAAGAATCCTCGAGGATTCTTCGGGAAGGATGTTCTTTTTG,AATTCAAAAAGAACATCCTTCCCGAAGAATCCTCGAGGATTCTTCGGGAAGGATGTTC,n/a
mouse,72745,Tmem161b,XM_006517403.3,TRCN0000095038,NM_024277.1-383s1c1,GAGAGTGTCCTTCTGATGAAT,pLKO.1,819,CDS,80,89,,,Y,78294,Rps27a,CCGGGAGAGTGTCCTTCTGATGAATCTCGAGATTCATCAGAAGGACACTCTCTTTTTG,AATTCAAAAAGAGAGTGTCCTTCTGATGAATCTCGAGATTCATCAGAAGGACACTCTC,n/a
mouse,72745,Tmem161b,XM_006517403.3,TRCN0000164465,NM_014427.3-358s1c1,CTTCACGGTGGACTACTACTT,pLKO.1,283,5UTR,80,89,,,Y,27132,CPNE7,CCGGCTTCACGGTGGACTACTACTTCTCGAGAAGTAGTAGTCCACCGTGAAGTTTTTG,AATTCAAAAACTTCACGGTGGACTACTACTTCTCGAGAAGTAGTAGTCCACCGTGAAG,n/a
mouse,72745,Tmem161b,XM_006517403.3,TRCN0000135894,NM_174901.2-685s1c1,GATGGGAAAGGAACTGAAAGA,pLKO.1,1806,3UTR,80,89,,,Y,171484,FAM9C,CCGGGATGGGAAAGGAACTGAAAGACTCGAGTCTTTCAGTTCCTTTCCCATCTTTTTG,AATTCAAAAAGATGGGAAAGGAACTGAAAGACTCGAGTCTTTCAGTTCCTTTCCCATC,n/a
mouse,72745,Tmem161b,XM_006517403.3,TRCN0000163847,NM_023002.1-439s1c1,CTATGAGTGCGAAGTCACCAA,pLKO.1,901,CDS,80,89,,,Y,404037,HAPLN4,CCGGCTATGAGTGCGAAGTCACCAACTCGAGTTGGTGACTTCGCACTCATAGTTTTTG,AATTCAAAAACTATGAGTGCGAAGTCACCAACTCGAGTTGGTGACTTCGCACTCATAG,n/a
mouse,72745,Tmem161b,XM_006517403.3,TRCN0000430878,NM_015694.2-2922s21c1,TGGATGAAACCAATCAGCACG,pLKO_005,768,CDS,80,89,,,Y,27153,ZNF777,CCGGTGGATGAAACCAATCAGCACGCTCGAGCGTGCTGATTGGTTTCATCCATTTTTG,AATTCAAAAATGGATGAAACCAATCAGCACGCTCGAGCGTGCTGATTGGTTTCATCCA,n/a
mouse,72745,Tmem161b,XM_006517403.3,TRCN0000083038,NM_001344.1-458s1c1,CTCTTTGAATTTCCTGGATAA,pLKO.1,641,CDS,81,85,,,Y,1603,DAD1,CCGGCTCTTTGAATTTCCTGGATAACTCGAGTTATCCAGGAAATTCAAAGAGTTTTTG,AATTCAAAAACTCTTTGAATTTCCTGGATAACTCGAGTTATCCAGGAAATTCAAAGAG,n/a
mouse,72745,Tmem161b,XM_006517403.3,TRCN0000290465,NM_001344.2-472s21c1,CTCTTTGAATTTCCTGGATAA,pLKO_005,641,CDS,81,85,,,Y,1603,DAD1,CCGGCTCTTTGAATTTCCTGGATAACTCGAGTTATCCAGGAAATTCAAAGAGTTTTTG,AATTCAAAAACTCTTTGAATTTCCTGGATAACTCGAGTTATCCAGGAAATTCAAAGAG,n/a
mouse,72745,Tmem161b,XM_006517403.3,TRCN0000129238,NM_001010905.1-762s1c1,CCTCTTTCCTACAACCTTGAT,pLKO.1,1325,CDS,81,85,,,Y,352999,C6orf58,CCGGCCTCTTTCCTACAACCTTGATCTCGAGATCAAGGTTGTAGGAAAGAGGTTTTTG,AATTCAAAAACCTCTTTCCTACAACCTTGATCTCGAGATCAAGGTTGTAGGAAAGAGG,n/a
mouse,72745,Tmem161b,XM_006517403.3,TRCN0000218603,XM_001480523.1-284s21c1,TACTGGATTACTTCCAGAACA,pLKO_005,246,5UTR,81,85,,,Y,,,CCGGTACTGGATTACTTCCAGAACACTCGAGTGTTCTGGAAGTAATCCAGTATTTTTG,AATTCAAAAATACTGGATTACTTCCAGAACACTCGAGTGTTCTGGAAGTAATCCAGTA,n/a
mouse,72745,Tmem161b,XM_006517403.3,TRCN0000177265,NM_178381.2-846s1c1,GATCTGTTTAATGATTGGCAT,pLKO.1,2021,3UTR,77,85,,,Y,71345,Ano9,CCGGGATCTGTTTAATGATTGGCATCTCGAGATGCCAATCATTAAACAGATCTTTTTG,AATTCAAAAAGATCTGTTTAATGATTGGCATCTCGAGATGCCAATCATTAAACAGATC,n/a
mouse,72745,Tmem161b,XM_006517403.3,TRCN0000005294,NM_004580.3-2635s1c1,CCTGTGCATTTGAATTGTATA,pLKO.1,1584,3UTR,77,85,,,Y,5873,RAB27A,CCGGCCTGTGCATTTGAATTGTATACTCGAGTATACAATTCAAATGCACAGGTTTTTG,AATTCAAAAACCTGTGCATTTGAATTGTATACTCGAGTATACAATTCAAATGCACAGG,n/a
