Taxon,"Gene ID","Gene Symbol",Transcript,"Clone ID","Legacy Clone Name","Target Seq",Vector,"Match Position","Match Region","Match %","SDR Match %","Intrinsic Score","Adjusted Score","Matches Other Gene in Same Taxon?","Orig. Target Gene ID","Orig. Target Gene Symbol","Forward Oligo Sequence","Reverse Oligo Sequence",Addgene
human,2176,FANCC,XM_006717001.3,TRCN0000083371,NM_000136.1-1810s1c1,CACGAGATCATTGGCTTTCTT,pLKO.1,1655,CDS,100,100,5.625,7.875,N,2176,FANCC,CCGGCACGAGATCATTGGCTTTCTTCTCGAGAAGAAAGCCAATGATCTCGTGTTTTTG,AATTCAAAAACACGAGATCATTGGCTTTCTTCTCGAGAAGAAAGCCAATGATCTCGTG,n/a
human,2176,FANCC,XM_006717001.3,TRCN0000083372,NM_000136.1-1046s1c1,GTGAGAGAAATTGTCTGAGAA,pLKO.1,888,CDS,100,100,4.95,3.96,N,2176,FANCC,CCGGGTGAGAGAAATTGTCTGAGAACTCGAGTTCTCAGACAATTTCTCTCACTTTTTG,AATTCAAAAAGTGAGAGAAATTGTCTGAGAACTCGAGTTCTCAGACAATTTCTCTCAC,n/a
human,2176,FANCC,XM_006717001.3,TRCN0000358556,NM_000136.2-2315s21c1,ATTTGGTCATGAACCATTAAA,pLKO_005,2150,3UTR,100,100,15,10.5,N,2176,FANCC,CCGGATTTGGTCATGAACCATTAAACTCGAGTTTAATGGTTCATGACCAAATTTTTTG,AATTCAAAAAATTTGGTCATGAACCATTAAACTCGAGTTTAATGGTTCATGACCAAAT,n/a
human,2176,FANCC,XM_006717001.3,TRCN0000083370,NM_000136.1-590s1c1,CCTGGATACAGGGTGTATTAT,pLKO.1,597,CDS,100,100,15,10.5,N,2176,FANCC,CCGGCCTGGATACAGGGTGTATTATCTCGAGATAATACACCCTGTATCCAGGTTTTTG,AATTCAAAAACCTGGATACAGGGTGTATTATCTCGAGATAATACACCCTGTATCCAGG,n/a
human,2176,FANCC,XM_006717001.3,TRCN0000358555,NM_000136.2-2267s21c1,TCAAGCTGCACATCTATTATT,pLKO_005,2102,3UTR,100,100,15,10.5,N,2176,FANCC,CCGGTCAAGCTGCACATCTATTATTCTCGAGAATAATAGATGTGCAGCTTGATTTTTG,AATTCAAAAATCAAGCTGCACATCTATTATTCTCGAGAATAATAGATGTGCAGCTTGA,n/a
human,2176,FANCC,XM_006717001.3,TRCN0000083368,NM_000136.1-1179s1c1,CCTGGAAATCATAGCCACTAT,pLKO.1,1021,CDS,100,100,4.95,3.465,N,2176,FANCC,CCGGCCTGGAAATCATAGCCACTATCTCGAGATAGTGGCTATGATTTCCAGGTTTTTG,AATTCAAAAACCTGGAAATCATAGCCACTATCTCGAGATAGTGGCTATGATTTCCAGG,n/a
human,2176,FANCC,XM_006717001.3,TRCN0000240590,NM_007985.2-765s21c1,TACTATCCTAGTTTGCTTAAA,pLKO_005,695,CDS,95,95,,,N,14088,Fancc,CCGGTACTATCCTAGTTTGCTTAAACTCGAGTTTAAGCAAACTAGGATAGTATTTTTG,AATTCAAAAATACTATCCTAGTTTGCTTAAACTCGAGTTTAAGCAAACTAGGATAGTA,n/a
human,2176,FANCC,XM_006717001.3,TRCN0000007228,NM_003879.3-1954s1c1,CACCTGTAATCCCAGCACTTT,pLKO.1,2571,3UTR,95,95,,,Y,8837,CFLAR,CCGGCACCTGTAATCCCAGCACTTTCTCGAGAAAGTGCTGGGATTACAGGTGTTTTTG,AATTCAAAAACACCTGTAATCCCAGCACTTTCTCGAGAAAGTGCTGGGATTACAGGTG,n/a
human,2176,FANCC,XM_006717001.3,TRCN0000166635,NM_001014373.1-2016s1c1,CACCTGTAATCCCAGCACTTT,pLKO.1,2571,3UTR,95,95,,,Y,404664,C19orf31,CCGGCACCTGTAATCCCAGCACTTTCTCGAGAAAGTGCTGGGATTACAGGTGTTTTTG,AATTCAAAAACACCTGTAATCCCAGCACTTTCTCGAGAAAGTGCTGGGATTACAGGTG,n/a
human,2176,FANCC,XM_006717001.3,TRCN0000021429,XM_370946.2-2284s1c1,CACACCTGTAATCCCAGCATT,pLKO.1,2569,3UTR,90,95,,,Y,10595,ERN2,CCGGCACACCTGTAATCCCAGCATTCTCGAGAATGCTGGGATTACAGGTGTGTTTTTG,AATTCAAAAACACACCTGTAATCCCAGCATTCTCGAGAATGCTGGGATTACAGGTGTG,n/a
human,2176,FANCC,XM_006717001.3,TRCN0000138998,NM_006455.2-1721s1c1,CACACCTGTAATCCCAGCATT,pLKO.1,2569,3UTR,90,95,,,Y,10609,P3H4,CCGGCACACCTGTAATCCCAGCATTCTCGAGAATGCTGGGATTACAGGTGTGTTTTTG,AATTCAAAAACACACCTGTAATCCCAGCATTCTCGAGAATGCTGGGATTACAGGTGTG,n/a
human,2176,FANCC,XM_006717001.3,TRCN0000344020,NM_006455.2-1721s21c1,CACACCTGTAATCCCAGCATT,pLKO_005,2569,3UTR,90,95,,,Y,10609,P3H4,CCGGCACACCTGTAATCCCAGCATTCTCGAGAATGCTGGGATTACAGGTGTGTTTTTG,AATTCAAAAACACACCTGTAATCCCAGCATTCTCGAGAATGCTGGGATTACAGGTGTG,n/a
human,2176,FANCC,XM_006717001.3,TRCN0000159231,NM_152363.2-2499s1c1,CGAAACCCTATCTCTACTAAA,pLKO.1,2653,3UTR,90,89,,,Y,126549,ANKLE1,CCGGCGAAACCCTATCTCTACTAAACTCGAGTTTAGTAGAGATAGGGTTTCGTTTTTG,AATTCAAAAACGAAACCCTATCTCTACTAAACTCGAGTTTAGTAGAGATAGGGTTTCG,n/a
human,2176,FANCC,XM_006717001.3,TRCN0000165230,NM_001004336.1-1551s1c1,GCAGTGGCTTACACCTGTAAT,pLKO.1,2560,3UTR,90,89,,,Y,440465,BAIAP2-DT,CCGGGCAGTGGCTTACACCTGTAATCTCGAGATTACAGGTGTAAGCCACTGCTTTTTG,AATTCAAAAAGCAGTGGCTTACACCTGTAATCTCGAGATTACAGGTGTAAGCCACTGC,n/a
human,2176,FANCC,XM_006717001.3,TRCN0000136382,NM_033319.1-1628s1c1,CACCTGTAATTCCAGCACTTT,pLKO.1,2571,3UTR,90,89,,,Y,91687,CENPL,CCGGCACCTGTAATTCCAGCACTTTCTCGAGAAAGTGCTGGAATTACAGGTGTTTTTG,AATTCAAAAACACCTGTAATTCCAGCACTTTCTCGAGAAAGTGCTGGAATTACAGGTG,n/a
human,2176,FANCC,XM_006717001.3,TRCN0000222574,NM_022350.1-3044s1c2,CGCCTGTAATCCCAGCACTTT,pLKO.1,2571,3UTR,90,89,,,Y,64167,ERAP2,CCGGCGCCTGTAATCCCAGCACTTTCTCGAGAAAGTGCTGGGATTACAGGCGTTTTTG,AATTCAAAAACGCCTGTAATCCCAGCACTTTCTCGAGAAAGTGCTGGGATTACAGGCG,n/a
human,2176,FANCC,XM_006717001.3,TRCN0000256749,NM_058182.4-686s21c1,CGTCTGTAATCCCAGCTACTC,pLKO_005,2705,3UTR,90,89,,,Y,54065,SMIM11A,CCGGCGTCTGTAATCCCAGCTACTCCTCGAGGAGTAGCTGGGATTACAGACGTTTTTG,AATTCAAAAACGTCTGTAATCCCAGCTACTCCTCGAGGAGTAGCTGGGATTACAGACG,n/a
human,2176,FANCC,XM_006717001.3,TRCN0000381969,NM_153262.2-1308s21c1,ACATGGCTCAGTTCCAGAAAT,pLKO_005,372,CDS,85,89,,,Y,255928,SYT14,CCGGACATGGCTCAGTTCCAGAAATCTCGAGATTTCTGGAACTGAGCCATGTTTTTTG,AATTCAAAAAACATGGCTCAGTTCCAGAAATCTCGAGATTTCTGGAACTGAGCCATGT,n/a
human,2176,FANCC,XM_006717001.3,TRCN0000265112,NM_026543.2-399s21c1,AGAGGGAGACCAGCTCTTAAG,pLKO_005,2815,3UTR,85,89,,,Y,68067,Mrnip,CCGGAGAGGGAGACCAGCTCTTAAGCTCGAGCTTAAGAGCTGGTCTCCCTCTTTTTTG,AATTCAAAAAAGAGGGAGACCAGCTCTTAAGCTCGAGCTTAAGAGCTGGTCTCCCTCT,n/a
human,2176,FANCC,XM_006717001.3,TRCN0000432094,NM_182833.1-707s21c1,TAATGTAATCACAAGGTTAAG,pLKO_005,2848,3UTR,85,89,,,Y,220032,GDPD4,CCGGTAATGTAATCACAAGGTTAAGCTCGAGCTTAACCTTGTGATTACATTATTTTTG,AATTCAAAAATAATGTAATCACAAGGTTAAGCTCGAGCTTAACCTTGTGATTACATTA,n/a
human,2176,FANCC,XM_006717001.3,TRCN0000058620,NM_001201.1-708s1c1,GCCACACTGTATTTCTGTATT,pLKO.1,2232,3UTR,85,89,,,Y,651,BMP3,CCGGGCCACACTGTATTTCTGTATTCTCGAGAATACAGAAATACAGTGTGGCTTTTTG,AATTCAAAAAGCCACACTGTATTTCTGTATTCTCGAGAATACAGAAATACAGTGTGGC,n/a
human,2176,FANCC,XM_006717001.3,TRCN0000118560,NM_024326.2-2142s1c1,GCCCTGGTGCTGCTGCAGGAT,pLKO.1,1142,CDS,85,89,,,Y,79176,FBXL15,CCGGGCCCTGGTGCTGCTGCAGGATCTCGAGATCCTGCAGCAGCACCAGGGCTTTTTG,AATTCAAAAAGCCCTGGTGCTGCTGCAGGATCTCGAGATCCTGCAGCAGCACCAGGGC,n/a
human,2176,FANCC,XM_006717001.3,TRCN0000078113,NM_006859.2-1344s1c1,GCCTGTAATCCCAGCACTTTA,pLKO.1,2572,3UTR,85,89,,,Y,11019,LIAS,CCGGGCCTGTAATCCCAGCACTTTACTCGAGTAAAGTGCTGGGATTACAGGCTTTTTG,AATTCAAAAAGCCTGTAATCCCAGCACTTTACTCGAGTAAAGTGCTGGGATTACAGGC,n/a
human,2176,FANCC,XM_006717001.3,TRCN0000225846,XM_001480523.1-237s21c1,AGATCTGTCATGTGATTATGA,pLKO_005,280,CDS,85,89,,,Y,,,CCGGAGATCTGTCATGTGATTATGACTCGAGTCATAATCACATGACAGATCTTTTTTG,AATTCAAAAAAGATCTGTCATGTGATTATGACTCGAGTCATAATCACATGACAGATCT,n/a
human,2176,FANCC,XM_006717001.3,TRCN0000130280,NM_032505.1-3886s1c1,CCTGCACAACAGTTGATCTTT,pLKO.1,1541,CDS,80,89,,,Y,84541,KBTBD8,CCGGCCTGCACAACAGTTGATCTTTCTCGAGAAAGATCAACTGTTGTGCAGGTTTTTG,AATTCAAAAACCTGCACAACAGTTGATCTTTCTCGAGAAAGATCAACTGTTGTGCAGG,n/a
human,2176,FANCC,XM_006717001.3,TRCN0000136370,NM_001018116.1-1129s1c1,CAGGTGAAAGTAGAGGATGAT,pLKO.1,2437,3UTR,80,89,,,Y,347273,CAVIN4,CCGGCAGGTGAAAGTAGAGGATGATCTCGAGATCATCCTCTACTTTCACCTGTTTTTG,AATTCAAAAACAGGTGAAAGTAGAGGATGATCTCGAGATCATCCTCTACTTTCACCTG,n/a
human,2176,FANCC,XM_006717001.3,TRCN0000137696,NM_025201.3-227s1c1,GCTGGTCTATGAGAATGAGGA,pLKO.1,1879,3UTR,80,89,,,Y,80301,PLEKHO2,CCGGGCTGGTCTATGAGAATGAGGACTCGAGTCCTCATTCTCATAGACCAGCTTTTTG,AATTCAAAAAGCTGGTCTATGAGAATGAGGACTCGAGTCCTCATTCTCATAGACCAGC,n/a
human,2176,FANCC,XM_006717001.3,TRCN0000107094,NM_014420.1-542s1c1,GAGAAAGTTGTCTGAGAACTT,pLKO.1,892,CDS,80,89,,,Y,27121,DKK4,CCGGGAGAAAGTTGTCTGAGAACTTCTCGAGAAGTTCTCAGACAACTTTCTCTTTTTG,AATTCAAAAAGAGAAAGTTGTCTGAGAACTTCTCGAGAAGTTCTCAGACAACTTTCTC,n/a
human,2176,FANCC,XM_006717001.3,TRCN0000183145,NM_014420.2-536s1c1,GAGAAAGTTGTCTGAGAACTT,pLKO.1,892,CDS,80,89,,,Y,27121,DKK4,CCGGGAGAAAGTTGTCTGAGAACTTCTCGAGAAGTTCTCAGACAACTTTCTCTTTTTG,AATTCAAAAAGAGAAAGTTGTCTGAGAACTTCTCGAGAAGTTCTCAGACAACTTTCTC,n/a
human,2176,FANCC,XM_006717001.3,TRCN0000167711,NM_022145.2-1205s1c1,GCTGCCATCTATTATTCATTT,pLKO.1,2106,3UTR,77,85,,,Y,64105,CENPK,CCGGGCTGCCATCTATTATTCATTTCTCGAGAAATGAATAATAGATGGCAGCTTTTTG,AATTCAAAAAGCTGCCATCTATTATTCATTTCTCGAGAAATGAATAATAGATGGCAGC,n/a
