Taxon,"Gene ID","Gene Symbol",Transcript,"Clone ID","Legacy Clone Name","Target Seq",Vector,"Match Position","Match Region","Match %","SDR Match %","Intrinsic Score","Adjusted Score","Matches Other Gene in Same Taxon?","Orig. Target Gene ID","Orig. Target Gene Symbol","Forward Oligo Sequence","Reverse Oligo Sequence",Addgene
mouse,208194,Exog,XM_011242947.2,TRCN0000191029,NM_172456.1-586s1c1,CGGAGAGATTTGAAGATGTTT,pLKO.1,708,CDS,100,100,5.625,7.875,N,208194,Exog,CCGGCGGAGAGATTTGAAGATGTTTCTCGAGAAACATCTTCAAATCTCTCCGTTTTTG,AATTCAAAAACGGAGAGATTTGAAGATGTTTCTCGAGAAACATCTTCAAATCTCTCCG,n/a
mouse,208194,Exog,XM_011242947.2,TRCN0000201610,NM_172456.1-272s1c1,CCTGTCTTACGATCAGGCAAA,pLKO.1,394,5UTR,100,100,4.05,5.67,N,208194,Exog,CCGGCCTGTCTTACGATCAGGCAAACTCGAGTTTGCCTGATCGTAAGACAGGTTTTTG,AATTCAAAAACCTGTCTTACGATCAGGCAAACTCGAGTTTGCCTGATCGTAAGACAGG,n/a
mouse,208194,Exog,XM_011242947.2,TRCN0000201784,NM_172456.1-1998s1c1,GCATTGTGTTTGCCTCCGATA,pLKO.1,2119,3UTR,100,100,4.05,3.24,N,208194,Exog,CCGGGCATTGTGTTTGCCTCCGATACTCGAGTATCGGAGGCAAACACAATGCTTTTTG,AATTCAAAAAGCATTGTGTTTGCCTCCGATACTCGAGTATCGGAGGCAAACACAATGC,n/a
mouse,208194,Exog,XM_011242947.2,TRCN0000190456,NM_172456.1-707s1c1,GCACCTTTACAAGGTGATCCT,pLKO.1,829,CDS,100,100,.264,.1848,N,208194,Exog,CCGGGCACCTTTACAAGGTGATCCTCTCGAGAGGATCACCTTGTAAAGGTGCTTTTTG,AATTCAAAAAGCACCTTTACAAGGTGATCCTCTCGAGAGGATCACCTTGTAAAGGTGC,n/a
mouse,208194,Exog,XM_011242947.2,TRCN0000425108,NM_005107.3-616s21c1,TATTGGAACAGAATAGAAATG,pLKO_005,671,CDS,95,95,,,Y,9941,EXOG,CCGGTATTGGAACAGAATAGAAATGCTCGAGCATTTCTATTCTGTTCCAATATTTTTG,AATTCAAAAATATTGGAACAGAATAGAAATGCTCGAGCATTTCTATTCTGTTCCAATA,n/a
mouse,208194,Exog,XM_011242947.2,TRCN0000431790,NM_005107.3-371s21c1,GATGGGTTCTTGAACATATTT,pLKO_005,426,5UTR,90,95,,,N,9941,EXOG,CCGGGATGGGTTCTTGAACATATTTCTCGAGAAATATGTTCAAGAACCCATCTTTTTG,AATTCAAAAAGATGGGTTCTTGAACATATTTCTCGAGAAATATGTTCAAGAACCCATC,n/a
mouse,208194,Exog,XM_011242947.2,TRCN0000218394,NM_013500.4-377s21c1,CCAGATCAAGACAGAGTTATT,pLKO_005,1593,3UTR,81,90,,,Y,12950,Hapln1,CCGGCCAGATCAAGACAGAGTTATTCTCGAGAATAACTCTGTCTTGATCTGGTTTTTG,AATTCAAAAACCAGATCAAGACAGAGTTATTCTCGAGAATAACTCTGTCTTGATCTGG,n/a
mouse,208194,Exog,XM_011242947.2,TRCN0000049857,NM_005107.1-620s1c1,CTTTGACCTTACCTCAGACTA,pLKO.1,744,CDS,90,89,,,Y,9941,EXOG,CCGGCTTTGACCTTACCTCAGACTACTCGAGTAGTCTGAGGTAAGGTCAAAGTTTTTG,AATTCAAAAACTTTGACCTTACCTCAGACTACTCGAGTAGTCTGAGGTAAGGTCAAAG,n/a
mouse,208194,Exog,XM_011242947.2,TRCN0000203913,NM_147011.1-496s1c1,CTCTGCTACTGTCACTCCAAT,pLKO.1,2077,3UTR,85,89,,,Y,259013,Olfr1044,CCGGCTCTGCTACTGTCACTCCAATCTCGAGATTGGAGTGACAGTAGCAGAGTTTTTG,AATTCAAAAACTCTGCTACTGTCACTCCAATCTCGAGATTGGAGTGACAGTAGCAGAG,n/a
mouse,208194,Exog,XM_011242947.2,TRCN0000184739,NM_182574.1-1337s1c1,CTGAAGGCCTCTCATCTGTTT,pLKO.1,1441,3UTR,85,89,,,Y,284358,MAMSTR,CCGGCTGAAGGCCTCTCATCTGTTTCTCGAGAAACAGATGAGAGGCCTTCAGTTTTTG,AATTCAAAAACTGAAGGCCTCTCATCTGTTTCTCGAGAAACAGATGAGAGGCCTTCAG,n/a
mouse,208194,Exog,XM_011242947.2,TRCN0000422688,NM_012200.2-880s21c1,TTCTGAGCCACCTTGTGGATC,pLKO_005,2815,3UTR,85,89,,,Y,26229,B3GAT3,CCGGTTCTGAGCCACCTTGTGGATCCTCGAGGATCCACAAGGTGGCTCAGAATTTTTG,AATTCAAAAATTCTGAGCCACCTTGTGGATCCTCGAGGATCCACAAGGTGGCTCAGAA,n/a
mouse,208194,Exog,XM_011242947.2,TRCN0000369035,NM_002794.3-673s21c1,TCCATGACCTGGATAACATTT,pLKO_005,957,CDS,85,89,,,Y,5690,PSMB2,CCGGTCCATGACCTGGATAACATTTCTCGAGAAATGTTATCCAGGTCATGGATTTTTG,AATTCAAAAATCCATGACCTGGATAACATTTCTCGAGAAATGTTATCCAGGTCATGGA,n/a
mouse,208194,Exog,XM_011242947.2,TRCN0000082810,NM_000093.2-3030s1c1,GCTCTATTGGATTCCCTGGAT,pLKO.1,2779,3UTR,85,89,,,Y,1289,COL5A1,CCGGGCTCTATTGGATTCCCTGGATCTCGAGATCCAGGGAATCCAATAGAGCTTTTTG,AATTCAAAAAGCTCTATTGGATTCCCTGGATCTCGAGATCCAGGGAATCCAATAGAGC,n/a
mouse,208194,Exog,XM_011242947.2,TRCN0000252768,NM_001033139.2-1120s21c1,AGAATCCAGTGCCACTGTTAA,pLKO_005,1469,3UTR,80,89,,,Y,68229,AI846148,CCGGAGAATCCAGTGCCACTGTTAACTCGAGTTAACAGTGGCACTGGATTCTTTTTTG,AATTCAAAAAAGAATCCAGTGCCACTGTTAACTCGAGTTAACAGTGGCACTGGATTCT,n/a
mouse,208194,Exog,XM_011242947.2,TRCN0000032805,XM_284356.2-1642s1c1,CACCTGTCAAAGCTCTGCAAA,pLKO.1,3695,3UTR,80,89,,,Y,330657,Prss53,CCGGCACCTGTCAAAGCTCTGCAAACTCGAGTTTGCAGAGCTTTGACAGGTGTTTTTG,AATTCAAAAACACCTGTCAAAGCTCTGCAAACTCGAGTTTGCAGAGCTTTGACAGGTG,n/a
mouse,208194,Exog,XM_011242947.2,TRCN0000005283,NM_000607.1-501s1c1,GCTGTCTGTCTATGCTGACAA,pLKO.1,1967,3UTR,80,89,,,Y,5004,ORM1,CCGGGCTGTCTGTCTATGCTGACAACTCGAGTTGTCAGCATAGACAGACAGCTTTTTG,AATTCAAAAAGCTGTCTGTCTATGCTGACAACTCGAGTTGTCAGCATAGACAGACAGC,n/a
mouse,208194,Exog,XM_011242947.2,TRCN0000097134,NM_010586.1-8081s1c1,CCTGCCTCATCACAGAGGGAT,pLKO.1,3585,3UTR,80,89,,,Y,16439,Itpr2,CCGGCCTGCCTCATCACAGAGGGATCTCGAGATCCCTCTGTGATGAGGCAGGTTTTTG,AATTCAAAAACCTGCCTCATCACAGAGGGATCTCGAGATCCCTCTGTGATGAGGCAGG,n/a
mouse,208194,Exog,XM_011242947.2,TRCN0000416983,NM_080388.1-860s21c1,AGCAGAGACCTCTCCACTTTC,pLKO_005,3435,3UTR,80,89,,,Y,140576,S100A16,CCGGAGCAGAGACCTCTCCACTTTCCTCGAGGAAAGTGGAGAGGTCTCTGCTTTTTTG,AATTCAAAAAAGCAGAGACCTCTCCACTTTCCTCGAGGAAAGTGGAGAGGTCTCTGCT,n/a
mouse,208194,Exog,XM_011242947.2,TRCN0000583830,,TGTCCAAGGACAAGACCATTT,pLKO_005,444,5UTR,80,89,,,Y,403244,OR2T35,CCGGTGTCCAAGGACAAGACCATTTCTCGAGAAATGGTCTTGTCCTTGGACATTTTTG,AATTCAAAAATGTCCAAGGACAAGACCATTTCTCGAGAAATGGTCTTGTCCTTGGACA,n/a
mouse,208194,Exog,XM_011242947.2,TRCN0000146855,NM_152614.1-234s1c1,CATATCAACATCTGGAGACAA,pLKO.1,3830,3UTR,80,89,,,Y,165100,TEX44,CCGGCATATCAACATCTGGAGACAACTCGAGTTGTCTCCAGATGTTGATATGTTTTTG,AATTCAAAAACATATCAACATCTGGAGACAACTCGAGTTGTCTCCAGATGTTGATATG,n/a
mouse,208194,Exog,XM_011242947.2,TRCN0000033624,NM_003226.1-242s1c1,CCCTGGGATGCAGGCTGAGCA,pLKO.1,2400,3UTR,80,89,,,Y,7033,TFF3,CCGGCCCTGGGATGCAGGCTGAGCACTCGAGTGCTCAGCCTGCATCCCAGGGTTTTTG,AATTCAAAAACCCTGGGATGCAGGCTGAGCACTCGAGTGCTCAGCCTGCATCCCAGGG,n/a
mouse,208194,Exog,XM_011242947.2,TRCN0000156179,NM_032172.1-288s1c1,CGAGTTCATCTGTACCTGATA,pLKO.1,1066,CDS,77,85,,,Y,84132,USP42,CCGGCGAGTTCATCTGTACCTGATACTCGAGTATCAGGTACAGATGAACTCGTTTTTG,AATTCAAAAACGAGTTCATCTGTACCTGATACTCGAGTATCAGGTACAGATGAACTCG,n/a
mouse,208194,Exog,XM_011242947.2,TRCN0000336944,NM_032172.2-314s21c1,CGAGTTCATCTGTACCTGATA,pLKO_005,1066,CDS,77,85,,,Y,84132,USP42,CCGGCGAGTTCATCTGTACCTGATACTCGAGTATCAGGTACAGATGAACTCGTTTTTG,AATTCAAAAACGAGTTCATCTGTACCTGATACTCGAGTATCAGGTACAGATGAACTCG,n/a
mouse,208194,Exog,XM_011242947.2,TRCN0000066518,NM_007643.2-2861s1c1,CCAGGGTAAGACACAGTGATA,pLKO.1,2220,3UTR,77,85,,,Y,12491,Cd36,CCGGCCAGGGTAAGACACAGTGATACTCGAGTATCACTGTGTCTTACCCTGGTTTTTG,AATTCAAAAACCAGGGTAAGACACAGTGATACTCGAGTATCACTGTGTCTTACCCTGG,n/a
mouse,208194,Exog,XM_011242947.2,TRCN0000070132,NM_008767.1-1241s1c1,CTCTGCATCTGTGCAACCATT,pLKO.1,2726,3UTR,77,85,,,Y,18400,Slc22a18,CCGGCTCTGCATCTGTGCAACCATTCTCGAGAATGGTTGCACAGATGCAGAGTTTTTG,AATTCAAAAACTCTGCATCTGTGCAACCATTCTCGAGAATGGTTGCACAGATGCAGAG,n/a
mouse,208194,Exog,XM_011242947.2,TRCN0000067362,NM_007706.1-664s1c1,GTTCACCTGTACCTGACCAAA,pLKO.1,1069,CDS,77,85,,,Y,216233,Socs2,CCGGGTTCACCTGTACCTGACCAAACTCGAGTTTGGTCAGGTACAGGTGAACTTTTTG,AATTCAAAAAGTTCACCTGTACCTGACCAAACTCGAGTTTGGTCAGGTACAGGTGAAC,n/a
mouse,208194,Exog,XM_011242947.2,TRCN0000420596,NM_015675.2-394s21c1,CTCTTGGCCATTGACGAGGAG,pLKO_005,3454,3UTR,77,85,,,Y,4616,GADD45B,CCGGCTCTTGGCCATTGACGAGGAGCTCGAGCTCCTCGTCAATGGCCAAGAGTTTTTG,AATTCAAAAACTCTTGGCCATTGACGAGGAGCTCGAGCTCCTCGTCAATGGCCAAGAG,n/a
