Taxon,"Gene ID","Gene Symbol",Transcript,"Clone ID","Legacy Clone Name","Target Seq",Vector,"Match Position","Match Region","Match %","SDR Match %","Intrinsic Score","Adjusted Score","Matches Other Gene in Same Taxon?","Orig. Target Gene ID","Orig. Target Gene Symbol","Forward Oligo Sequence","Reverse Oligo Sequence",Addgene
human,158046,NXNL2,XM_011518276.2,TRCN0000422820,NM_145283.2-471s21c1,CGCTGCTCTGCGACTTCTATA,pLKO_005,484,CDS,100,100,13.2,9.24,N,158046,NXNL2,CCGGCGCTGCTCTGCGACTTCTATACTCGAGTATAGAAGTCGCAGAGCAGCGTTTTTG,AATTCAAAAACGCTGCTCTGCGACTTCTATACTCGAGTATAGAAGTCGCAGAGCAGCG,n/a
human,158046,NXNL2,XM_011518276.2,TRCN0000414072,NM_145283.2-411s21c1,ACAAGGTGGTGGCACTGTACT,pLKO_005,424,CDS,100,100,4.95,3.465,N,158046,NXNL2,CCGGACAAGGTGGTGGCACTGTACTCTCGAGAGTACAGTGCCACCACCTTGTTTTTTG,AATTCAAAAAACAAGGTGGTGGCACTGTACTCTCGAGAGTACAGTGCCACCACCTTGT,n/a
human,158046,NXNL2,XM_011518276.2,TRCN0000064895,NM_024623.1-611s1c1,GCCTGAGGTCTACGACTCACT,pLKO.1,878,3UTR,81,90,,,Y,79676,OGFOD2,CCGGGCCTGAGGTCTACGACTCACTCTCGAGAGTGAGTCGTAGACCTCAGGCTTTTTG,AATTCAAAAAGCCTGAGGTCTACGACTCACTCTCGAGAGTGAGTCGTAGACCTCAGGC,n/a
human,158046,NXNL2,XM_011518276.2,TRCN0000114360,NM_029173.1-446s1c1,CGACTTCTACACGGAGCTGGT,pLKO.1,494,CDS,90,89,,,Y,75124,Nxnl2,CCGGCGACTTCTACACGGAGCTGGTCTCGAGACCAGCTCCGTGTAGAAGTCGTTTTTG,AATTCAAAAACGACTTCTACACGGAGCTGGTCTCGAGACCAGCTCCGTGTAGAAGTCG,n/a
human,158046,NXNL2,XM_011518276.2,TRCN0000143932,NM_017828.2-1188s1c1,CCAGAACTGTGAGAAAGAAAT,pLKO.1,1124,3UTR,90,89,,,Y,54939,COMMD4,CCGGCCAGAACTGTGAGAAAGAAATCTCGAGATTTCTTTCTCACAGTTCTGGTTTTTG,AATTCAAAAACCAGAACTGTGAGAAAGAAATCTCGAGATTTCTTTCTCACAGTTCTGG,n/a
human,158046,NXNL2,XM_011518276.2,TRCN0000114716,NM_138684.2-425s1c1,CCTCCAGAACTCTGAGAAATA,pLKO.1,1121,3UTR,90,89,,,Y,192200,Wfdc12,CCGGCCTCCAGAACTCTGAGAAATACTCGAGTATTTCTCAGAGTTCTGGAGGTTTTTG,AATTCAAAAACCTCCAGAACTCTGAGAAATACTCGAGTATTTCTCAGAGTTCTGGAGG,n/a
human,158046,NXNL2,XM_011518276.2,TRCN0000360609,NM_030612.3-2710s21c1,CCAGGTATCTGGGATCTATAT,pLKO_005,114,5UTR,80,89,,,Y,80859,Nfkbiz,CCGGCCAGGTATCTGGGATCTATATCTCGAGATATAGATCCCAGATACCTGGTTTTTG,AATTCAAAAACCAGGTATCTGGGATCTATATCTCGAGATATAGATCCCAGATACCTGG,n/a
human,158046,NXNL2,XM_011518276.2,TRCN0000158396,NM_005276.2-1056s1c1,CCTGCAGAATCATCCAGAACA,pLKO.1,737,CDS,80,89,,,Y,2819,GPD1,CCGGCCTGCAGAATCATCCAGAACACTCGAGTGTTCTGGATGATTCTGCAGGTTTTTG,AATTCAAAAACCTGCAGAATCATCCAGAACACTCGAGTGTTCTGGATGATTCTGCAGG,n/a
human,158046,NXNL2,XM_011518276.2,TRCN0000242301,XM_357358.3-719s21c1,AGGAGATGATGGGCTTCATTT,pLKO_005,577,CDS,80,89,,,Y,383977,Spopfm3,CCGGAGGAGATGATGGGCTTCATTTCTCGAGAAATGAAGCCCATCATCTCCTTTTTTG,AATTCAAAAAAGGAGATGATGGGCTTCATTTCTCGAGAAATGAAGCCCATCATCTCCT,n/a
human,158046,NXNL2,XM_011518276.2,TRCN0000276973,NM_145605.1-1901s21c1,GAGTGGTCTTCTGTGAGCCTT,pLKO_005,544,CDS,77,85,,,Y,234825,Klhdc4,CCGGGAGTGGTCTTCTGTGAGCCTTCTCGAGAAGGCTCACAGAAGACCACTCTTTTTG,AATTCAAAAAGAGTGGTCTTCTGTGAGCCTTCTCGAGAAGGCTCACAGAAGACCACTC,n/a
human,158046,NXNL2,XM_011518276.2,TRCN0000197293,NM_028186.2-1730s1c2,GCTACCTTTCTCCATGCCATT,pLKO.1,675,CDS,77,85,,,Y,72293,Nkd2,CCGGGCTACCTTTCTCCATGCCATTCTCGAGAATGGCATGGAGAAAGGTAGCTTTTTG,AATTCAAAAAGCTACCTTTCTCCATGCCATTCTCGAGAATGGCATGGAGAAAGGTAGC,n/a
