Taxon,"Gene ID","Gene Symbol",Transcript,"Clone ID","Legacy Clone Name","Target Seq",Vector,"Match Position","Match Region","Match %","SDR Match %","Intrinsic Score","Adjusted Score","Matches Other Gene in Same Taxon?","Orig. Target Gene ID","Orig. Target Gene Symbol","Forward Oligo Sequence","Reverse Oligo Sequence",Addgene
human,126123,IZUMO2,XM_011526437.2,TRCN0000135404,NM_152358.1-493s1c1,GTACCAGATGGACAGCAAATA,pLKO.1,517,CDS,100,100,0,0,N,126123,IZUMO2,CCGGGTACCAGATGGACAGCAAATACTCGAGTATTTGCTGTCCATCTGGTACTTTTTG,AATTCAAAAAGTACCAGATGGACAGCAAATACTCGAGTATTTGCTGTCCATCTGGTAC,n/a
human,126123,IZUMO2,XM_011526437.2,TRCN0000137316,NM_152358.1-424s1c1,GAGGATCACTCCCAAGTGTAT,pLKO.1,477,CDS,100,100,4.95,3.465,N,126123,IZUMO2,CCGGGAGGATCACTCCCAAGTGTATCTCGAGATACACTTGGGAGTGATCCTCTTTTTG,AATTCAAAAAGAGGATCACTCCCAAGTGTATCTCGAGATACACTTGGGAGTGATCCTC,n/a
human,126123,IZUMO2,XM_011526437.2,TRCN0000135572,NM_152358.1-202s1c1,GACAAATCAACTGGACCTTGT,pLKO.1,276,CDS,100,100,4.05,2.835,N,126123,IZUMO2,CCGGGACAAATCAACTGGACCTTGTCTCGAGACAAGGTCCAGTTGATTTGTCTTTTTG,AATTCAAAAAGACAAATCAACTGGACCTTGTCTCGAGACAAGGTCCAGTTGATTTGTC,n/a
human,126123,IZUMO2,XM_011526437.2,TRCN0000135796,NM_152358.1-538s1c1,CATCCTCATTTCTGTGTCTCT,pLKO.1,562,CDS,100,100,2.64,1.848,N,126123,IZUMO2,CCGGCATCCTCATTTCTGTGTCTCTCTCGAGAGAGACACAGAAATGAGGATGTTTTTG,AATTCAAAAACATCCTCATTTCTGTGTCTCTCTCGAGAGAGACACAGAAATGAGGATG,n/a
human,126123,IZUMO2,XM_011526437.2,TRCN0000177679,NM_028002.1-1290s1c1,CTAAAGGAAGAGGTTTGGAAA,pLKO.1,442,CDS,81,90,,,N,71916,Dus4l,CCGGCTAAAGGAAGAGGTTTGGAAACTCGAGTTTCCAAACCTCTTCCTTTAGTTTTTG,AATTCAAAAACTAAAGGAAGAGGTTTGGAAACTCGAGTTTCCAAACCTCTTCCTTTAG,n/a
human,126123,IZUMO2,XM_011526437.2,TRCN0000057172,NM_000065.1-2167s1c1,CATGCCTTACTGGCTTTGAAA,pLKO.1,42,5UTR,80,89,,,Y,729,C6,CCGGCATGCCTTACTGGCTTTGAAACTCGAGTTTCAAAGCCAGTAAGGCATGTTTTTG,AATTCAAAAACATGCCTTACTGGCTTTGAAACTCGAGTTTCAAAGCCAGTAAGGCATG,n/a
human,126123,IZUMO2,XM_011526437.2,TRCN0000070988,NM_009409.2-5346s1c1,CCTTGTGTTGTCCTTTGTCTT,pLKO.1,291,CDS,80,89,,,Y,21974,Top2b,CCGGCCTTGTGTTGTCCTTTGTCTTCTCGAGAAGACAAAGGACAACACAAGGTTTTTG,AATTCAAAAACCTTGTGTTGTCCTTTGTCTTCTCGAGAAGACAAAGGACAACACAAGG,n/a
human,126123,IZUMO2,XM_011526437.2,TRCN0000349348,NM_009409.2-5346s21c1,CCTTGTGTTGTCCTTTGTCTT,pLKO_005,291,CDS,80,89,,,Y,21974,Top2b,CCGGCCTTGTGTTGTCCTTTGTCTTCTCGAGAAGACAAAGGACAACACAAGGTTTTTG,AATTCAAAAACCTTGTGTTGTCCTTTGTCTTCTCGAGAAGACAAAGGACAACACAAGG,n/a
human,126123,IZUMO2,XM_011526437.2,TRCN0000185198,NM_207563.1-84s1c1,CTTTCTCTTCTTGGTCATCTA,pLKO.1,589,CDS,80,89,,,Y,404325,Olfr1057,CCGGCTTTCTCTTCTTGGTCATCTACTCGAGTAGATGACCAAGAAGAGAAAGTTTTTG,AATTCAAAAACTTTCTCTTCTTGGTCATCTACTCGAGTAGATGACCAAGAAGAGAAAG,n/a
