Taxon,"Gene ID","Gene Symbol",Transcript,"Clone ID","Legacy Clone Name","Target Seq",Vector,"Match Position","Match Region","Match %","SDR Match %","Intrinsic Score","Adjusted Score","Matches Other Gene in Same Taxon?","Orig. Target Gene ID","Orig. Target Gene Symbol","Forward Oligo Sequence","Reverse Oligo Sequence",Addgene
human,148137,PROSER3,XM_011526529.3,TRCN0000180523,NM_144692.1-839s1c1,GCCAGAGGATGACATTCTGTA,pLKO.1,900,CDS,100,100,4.95,3.465,N,148137,PROSER3,CCGGGCCAGAGGATGACATTCTGTACTCGAGTACAGAATGTCATCCTCTGGCTTTTTG,AATTCAAAAAGCCAGAGGATGACATTCTGTACTCGAGTACAGAATGTCATCCTCTGGC,n/a
human,148137,PROSER3,XM_011526529.3,TRCN0000179989,NM_144692.1-63s1c1,CAAGATAGTCCCTTTGGAGAT,pLKO.1,91,CDS,100,100,4.05,2.43,N,148137,PROSER3,CCGGCAAGATAGTCCCTTTGGAGATCTCGAGATCTCCAAAGGGACTATCTTGTTTTTG,AATTCAAAAACAAGATAGTCCCTTTGGAGATCTCGAGATCTCCAAAGGGACTATCTTG,n/a
human,148137,PROSER3,XM_011526529.3,TRCN0000583875,,CACTACCATTTCTCCCAAGTT,pLKO_005,2719,3UTR,81,90,,,Y,81318,OR4A5,CCGGCACTACCATTTCTCCCAAGTTCTCGAGAACTTGGGAGAAATGGTAGTGTTTTTG,AATTCAAAAACACTACCATTTCTCCCAAGTTCTCGAGAACTTGGGAGAAATGGTAGTG,n/a
human,148137,PROSER3,XM_011526529.3,TRCN0000082424,NM_018221.1-725s1c1,CCTCCTTTAAGCACTTTATTT,pLKO.1,2473,3UTR,85,89,,,Y,55233,MOB1A,CCGGCCTCCTTTAAGCACTTTATTTCTCGAGAAATAAAGTGCTTAAAGGAGGTTTTTG,AATTCAAAAACCTCCTTTAAGCACTTTATTTCTCGAGAAATAAAGTGCTTAAAGGAGG,n/a
human,148137,PROSER3,XM_011526529.3,TRCN0000300714,NM_018221.3-736s21c1,CCTCCTTTAAGCACTTTATTT,pLKO_005,2473,3UTR,85,89,,,Y,55233,MOB1A,CCGGCCTCCTTTAAGCACTTTATTTCTCGAGAAATAAAGTGCTTAAAGGAGGTTTTTG,AATTCAAAAACCTCCTTTAAGCACTTTATTTCTCGAGAAATAAAGTGCTTAAAGGAGG,n/a
human,148137,PROSER3,XM_011526529.3,TRCN0000583855,,TCTGTCTGTAATCCTAGATTT,pLKO_005,2673,3UTR,85,89,,,Y,390326,OR6C76,CCGGTCTGTCTGTAATCCTAGATTTCTCGAGAAATCTAGGATTACAGACAGATTTTTG,AATTCAAAAATCTGTCTGTAATCCTAGATTTCTCGAGAAATCTAGGATTACAGACAGA,n/a
human,148137,PROSER3,XM_011526529.3,TRCN0000115400,NM_018745.2-630s1c1,CCTGTTGGATGAAGGAACAAA,pLKO.1,11,5UTR,85,89,,,Y,54375,Azin1,CCGGCCTGTTGGATGAAGGAACAAACTCGAGTTTGTTCCTTCATCCAACAGGTTTTTG,AATTCAAAAACCTGTTGGATGAAGGAACAAACTCGAGTTTGTTCCTTCATCCAACAGG,n/a
human,148137,PROSER3,XM_011526529.3,TRCN0000325635,NM_018745.5-629s21c1,CCTGTTGGATGAAGGAACAAA,pLKO_005,11,5UTR,85,89,,,Y,54375,Azin1,CCGGCCTGTTGGATGAAGGAACAAACTCGAGTTTGTTCCTTCATCCAACAGGTTTTTG,AATTCAAAAACCTGTTGGATGAAGGAACAAACTCGAGTTTGTTCCTTCATCCAACAGG,n/a
human,148137,PROSER3,XM_011526529.3,TRCN0000179623,NM_024872.1-216s1c1,GCATGTCAAGTTTGGCAAGAA,pLKO.1,2550,3UTR,85,89,,,Y,79930,DOK3,CCGGGCATGTCAAGTTTGGCAAGAACTCGAGTTCTTGCCAAACTTGACATGCTTTTTG,AATTCAAAAAGCATGTCAAGTTTGGCAAGAACTCGAGTTCTTGCCAAACTTGACATGC,n/a
human,148137,PROSER3,XM_011526529.3,TRCN0000180552,NM_024872.1-213s1c1,GCAGCATGTCAAGTTTGGCAA,pLKO.1,2547,3UTR,85,89,,,Y,79930,DOK3,CCGGGCAGCATGTCAAGTTTGGCAACTCGAGTTGCCAAACTTGACATGCTGCTTTTTG,AATTCAAAAAGCAGCATGTCAAGTTTGGCAACTCGAGTTGCCAAACTTGACATGCTGC,n/a
human,148137,PROSER3,XM_011526529.3,TRCN0000240087,XM_001005103.2-282s21c1,TGGCCCAGCATGTGAACTTAG,pLKO_005,2543,3UTR,85,89,,,Y,677582,LOC677582,CCGGTGGCCCAGCATGTGAACTTAGCTCGAGCTAAGTTCACATGCTGGGCCATTTTTG,AATTCAAAAATGGCCCAGCATGTGAACTTAGCTCGAGCTAAGTTCACATGCTGGGCCA,n/a
human,148137,PROSER3,XM_011526529.3,TRCN0000167692,NM_182751.1-3301s1c1,GCCAGATTTCTTCATTCAATT,pLKO.1,75,CDS,80,89,,,Y,55388,MCM10,CCGGGCCAGATTTCTTCATTCAATTCTCGAGAATTGAATGAAGAAATCTGGCTTTTTG,AATTCAAAAAGCCAGATTTCTTCATTCAATTCTCGAGAATTGAATGAAGAAATCTGGC,n/a
human,148137,PROSER3,XM_011526529.3,TRCN0000073635,NM_000412.2-1285s1c1,CCCATAACCAAGGTCACTGTT,pLKO.1,1718,CDS,80,89,,,Y,3273,HRG,CCGGCCCATAACCAAGGTCACTGTTCTCGAGAACAGTGACCTTGGTTATGGGTTTTTG,AATTCAAAAACCCATAACCAAGGTCACTGTTCTCGAGAACAGTGACCTTGGTTATGGG,n/a
human,148137,PROSER3,XM_011526529.3,TRCN0000190544,NM_026886.1-115s1c1,GCTGTTTGAGAAGTTCTGGAA,pLKO.1,249,CDS,80,89,,,Y,68955,Srrm4,CCGGGCTGTTTGAGAAGTTCTGGAACTCGAGTTCCAGAACTTCTCAAACAGCTTTTTG,AATTCAAAAAGCTGTTTGAGAAGTTCTGGAACTCGAGTTCCAGAACTTCTCAAACAGC,n/a
human,148137,PROSER3,XM_011526529.3,TRCN0000078487,NM_012213.1-958s1c1,GTCTGTCACCTATACCTGGTT,pLKO.1,2676,3UTR,80,89,,,Y,23417,MLYCD,CCGGGTCTGTCACCTATACCTGGTTCTCGAGAACCAGGTATAGGTGACAGACTTTTTG,AATTCAAAAAGTCTGTCACCTATACCTGGTTCTCGAGAACCAGGTATAGGTGACAGAC,n/a
human,148137,PROSER3,XM_011526529.3,TRCN0000423342,NM_029416.2-646s21c1,CCATGCTGTGGCTCCGTTTAT,pLKO_005,567,CDS,80,89,,,Y,75753,Klf17,CCGGCCATGCTGTGGCTCCGTTTATCTCGAGATAAACGGAGCCACAGCATGGTTTTTG,AATTCAAAAACCATGCTGTGGCTCCGTTTATCTCGAGATAAACGGAGCCACAGCATGG,n/a
human,148137,PROSER3,XM_011526529.3,TRCN0000144946,NM_001001678.1-1566s1c1,GAAATGGACCAAAGGACTTAA,pLKO.1,2349,CDS,80,89,,,Y,399833,SPRNP1,CCGGGAAATGGACCAAAGGACTTAACTCGAGTTAAGTCCTTTGGTCCATTTCTTTTTG,AATTCAAAAAGAAATGGACCAAAGGACTTAACTCGAGTTAAGTCCTTTGGTCCATTTC,n/a
human,148137,PROSER3,XM_011526529.3,TRCN0000362642,NM_009046.2-1528s21c1,TTTCTTCCCTGCTTCCATATC,pLKO_005,2487,3UTR,81,85,,,Y,19698,Relb,CCGGTTTCTTCCCTGCTTCCATATCCTCGAGGATATGGAAGCAGGGAAGAAATTTTTG,AATTCAAAAATTTCTTCCCTGCTTCCATATCCTCGAGGATATGGAAGCAGGGAAGAAA,n/a
human,148137,PROSER3,XM_011526529.3,TRCN0000306027,NM_016882.3-2904s21c1,CCTGTCACACTGCGGTCAAAT,pLKO_005,532,CDS,77,85,,,Y,20227,Sart1,CCGGCCTGTCACACTGCGGTCAAATCTCGAGATTTGACCGCAGTGTGACAGGTTTTTG,AATTCAAAAACCTGTCACACTGCGGTCAAATCTCGAGATTTGACCGCAGTGTGACAGG,n/a
human,148137,PROSER3,XM_011526529.3,TRCN0000192131,NM_206935.1-145s1c1,CCTACCCAAGGTTTAAATGCA,pLKO.1,2729,3UTR,77,85,,,Y,384185,Arl9,CCGGCCTACCCAAGGTTTAAATGCACTCGAGTGCATTTAAACCTTGGGTAGGTTTTTG,AATTCAAAAACCTACCCAAGGTTTAAATGCACTCGAGTGCATTTAAACCTTGGGTAGG,n/a
human,148137,PROSER3,XM_011526529.3,TRCN0000016930,NM_145262.2-178s1c1,CAGCTGTTTGAGAGTGCTGTA,pLKO.1,247,CDS,77,85,,,Y,132158,GLYCTK,CCGGCAGCTGTTTGAGAGTGCTGTACTCGAGTACAGCACTCTCAAACAGCTGTTTTTG,AATTCAAAAACAGCTGTTTGAGAGTGCTGTACTCGAGTACAGCACTCTCAAACAGCTG,n/a
human,148137,PROSER3,XM_011526529.3,TRCN0000082217,NM_021441.1-1521s1c1,GCATCTCATCTGCACCCAGTT,pLKO.1,2588,3UTR,77,85,,,Y,21341,Taf1c,CCGGGCATCTCATCTGCACCCAGTTCTCGAGAACTGGGTGCAGATGAGATGCTTTTTG,AATTCAAAAAGCATCTCATCTGCACCCAGTTCTCGAGAACTGGGTGCAGATGAGATGC,n/a
human,148137,PROSER3,XM_011526529.3,TRCN0000052771,XM_350880.3-753s1c1,CCCAAACAGGAACTCATCCAA,pLKO.1,605,CDS,77,85,,,Y,57460,PPM1H,CCGGCCCAAACAGGAACTCATCCAACTCGAGTTGGATGAGTTCCTGTTTGGGTTTTTG,AATTCAAAAACCCAAACAGGAACTCATCCAACTCGAGTTGGATGAGTTCCTGTTTGGG,n/a
human,148137,PROSER3,XM_011526529.3,TRCN0000368625,NM_007223.1-1990s21c1,TTGGGCAGCAGCAGATCTTTA,pLKO_005,2437,CDS,77,85,,,Y,11245,GPR176,CCGGTTGGGCAGCAGCAGATCTTTACTCGAGTAAAGATCTGCTGCTGCCCAATTTTTG,AATTCAAAAATTGGGCAGCAGCAGATCTTTACTCGAGTAAAGATCTGCTGCTGCCCAA,n/a
