Taxon,"Gene ID","Gene Symbol",Transcript,"Clone ID","Legacy Clone Name","Target Seq",Vector,"Match Position","Match Region","Match %","SDR Match %","Intrinsic Score","Adjusted Score","Matches Other Gene in Same Taxon?","Orig. Target Gene ID","Orig. Target Gene Symbol","Forward Oligo Sequence","Reverse Oligo Sequence",Addgene
human,342897,NCCRP1,XM_011526906.3,TRCN0000060507,NM_001001414.1-533s1c1,GATGACGAACAACCAGCCATT,pLKO.1,533,CDS,100,100,4.05,5.67,N,342897,NCCRP1,CCGGGATGACGAACAACCAGCCATTCTCGAGAATGGCTGGTTGTTCGTCATCTTTTTG,AATTCAAAAAGATGACGAACAACCAGCCATTCTCGAGAATGGCTGGTTGTTCGTCATC,n/a
human,342897,NCCRP1,XM_011526906.3,TRCN0000060505,NM_001001414.1-350s1c1,CCCGAAGGCATCAACATTTAT,pLKO.1,350,CDS,100,100,15,10.5,N,342897,NCCRP1,CCGGCCCGAAGGCATCAACATTTATCTCGAGATAAATGTTGATGCCTTCGGGTTTTTG,AATTCAAAAACCCGAAGGCATCAACATTTATCTCGAGATAAATGTTGATGCCTTCGGG,n/a
human,342897,NCCRP1,XM_011526906.3,TRCN0000060506,NM_001001414.1-406s1c1,CCTGGAAACTCTGGGCAATTT,pLKO.1,406,CDS,100,100,13.2,9.24,N,342897,NCCRP1,CCGGCCTGGAAACTCTGGGCAATTTCTCGAGAAATTGCCCAGAGTTTCCAGGTTTTTG,AATTCAAAAACCTGGAAACTCTGGGCAATTTCTCGAGAAATTGCCCAGAGTTTCCAGG,n/a
human,342897,NCCRP1,XM_011526906.3,TRCN0000060504,NM_001001414.1-432s1c1,GCTGGTACATTAGAACTGAAA,pLKO.1,432,CDS,100,100,4.95,3.465,N,342897,NCCRP1,CCGGGCTGGTACATTAGAACTGAAACTCGAGTTTCAGTTCTAATGTACCAGCTTTTTG,AATTCAAAAAGCTGGTACATTAGAACTGAAACTCGAGTTTCAGTTCTAATGTACCAGC,n/a
human,342897,NCCRP1,XM_011526906.3,TRCN0000005263,NM_005551.2-160s1c1,TGGCTGTGTACAGTCATGGAT,pLKO.1,922,3UTR,85,89,,,Y,3817,KLK2,CCGGTGGCTGTGTACAGTCATGGATCTCGAGATCCATGACTGTACACAGCCATTTTTG,AATTCAAAAATGGCTGTGTACAGTCATGGATCTCGAGATCCATGACTGTACACAGCCA,n/a
human,342897,NCCRP1,XM_011526906.3,TRCN0000185514,NM_207145.1-607s1c1,GCTTTCATGTTTGGTGGTATT,pLKO.1,813,3UTR,85,89,,,Y,258249,Olfr845,CCGGGCTTTCATGTTTGGTGGTATTCTCGAGAATACCACCAAACATGAAAGCTTTTTG,AATTCAAAAAGCTTTCATGTTTGGTGGTATTCTCGAGAATACCACCAAACATGAAAGC,n/a
human,342897,NCCRP1,XM_011526906.3,TRCN0000094694,NM_053135.1-2064s1c1,GCTGTACTTGGTCATTGCTTT,pLKO.1,880,3UTR,85,89,,,Y,93881,Pcdhb10,CCGGGCTGTACTTGGTCATTGCTTTCTCGAGAAAGCAATGACCAAGTACAGCTTTTTG,AATTCAAAAAGCTGTACTTGGTCATTGCTTTCTCGAGAAAGCAATGACCAAGTACAGC,n/a
human,342897,NCCRP1,XM_011526906.3,TRCN0000437933,NM_130775.2-246s21c1,CCTAACCTGGAAGCTGATCTC,pLKO_005,286,CDS,80,89,,,Y,170627,XAGE5,CCGGCCTAACCTGGAAGCTGATCTCCTCGAGGAGATCAGCTTCCAGGTTAGGTTTTTG,AATTCAAAAACCTAACCTGGAAGCTGATCTCCTCGAGGAGATCAGCTTCCAGGTTAGG,n/a
human,342897,NCCRP1,XM_011526906.3,TRCN0000364519,NM_178232.2-1236s21c1,TTCCCTCACTGGCTGTGTATT,pLKO_005,839,3UTR,81,85,,,Y,145864,HAPLN3,CCGGTTCCCTCACTGGCTGTGTATTCTCGAGAATACACAGCCAGTGAGGGAATTTTTG,AATTCAAAAATTCCCTCACTGGCTGTGTATTCTCGAGAATACACAGCCAGTGAGGGAA,n/a
human,342897,NCCRP1,XM_011526906.3,TRCN0000127960,NM_198563.1-247s1c1,CGCTTCAGAGAACCAAAGCAT,pLKO.1,453,CDS,77,85,,,Y,375346,STIMATE,CCGGCGCTTCAGAGAACCAAAGCATCTCGAGATGCTTTGGTTCTCTGAAGCGTTTTTG,AATTCAAAAACGCTTCAGAGAACCAAAGCATCTCGAGATGCTTTGGTTCTCTGAAGCG,n/a
