Taxon,"Gene ID","Gene Symbol",Transcript,"Clone ID","Legacy Clone Name","Target Seq",Vector,"Match Position","Match Region","Match %","SDR Match %","Intrinsic Score","Adjusted Score","Matches Other Gene in Same Taxon?","Orig. Target Gene ID","Orig. Target Gene Symbol","Forward Oligo Sequence","Reverse Oligo Sequence",Addgene
human,150684,COMMD1,XM_011532558.2,TRCN0000436958,NM_152516.2-112s21c1,TGCTACGGAGCCAGCTATATC,pLKO_005,136,CDS,100,100,13.2,18.48,N,150684,COMMD1,CCGGTGCTACGGAGCCAGCTATATCCTCGAGGATATAGCTGGCTCCGTAGCATTTTTG,AATTCAAAAATGCTACGGAGCCAGCTATATCCTCGAGGATATAGCTGGCTCCGTAGCA,n/a
human,150684,COMMD1,XM_011532558.2,TRCN0000439509,NM_152516.2-390s21c1,GATGGCAAGTCTCAGTCAAGG,pLKO_005,414,CDS,100,100,4.05,5.67,N,150684,COMMD1,CCGGGATGGCAAGTCTCAGTCAAGGCTCGAGCCTTGACTGAGACTTGCCATCTTTTTG,AATTCAAAAAGATGGCAAGTCTCAGTCAAGGCTCGAGCCTTGACTGAGACTTGCCATC,n/a
human,150684,COMMD1,XM_011532558.2,TRCN0000444197,NM_152516.2-339s21c1,ATGAACCAGAGCCGCTGGAAT,pLKO_005,363,CDS,100,100,4.95,3.465,N,150684,COMMD1,CCGGATGAACCAGAGCCGCTGGAATCTCGAGATTCCAGCGGCTCTGGTTCATTTTTTG,AATTCAAAAAATGAACCAGAGCCGCTGGAATCTCGAGATTCCAGCGGCTCTGGTTCAT,n/a
human,150684,COMMD1,XM_011532558.2,TRCN0000439491,NM_152516.2-256s21c1,AGCAAGGTGGGATCACATCTG,pLKO_005,280,CDS,100,100,4.05,2.835,N,150684,COMMD1,CCGGAGCAAGGTGGGATCACATCTGCTCGAGCAGATGTGATCCCACCTTGCTTTTTTG,AATTCAAAAAAGCAAGGTGGGATCACATCTGCTCGAGCAGATGTGATCCCACCTTGCT,n/a
human,150684,COMMD1,XM_011532558.2,TRCN0000168455,NM_152516.1-415s1c1,GCTCAAATACACACACCTGTT,pLKO.1,441,CDS,100,100,4.05,2.835,N,150684,COMMD1,CCGGGCTCAAATACACACACCTGTTCTCGAGAACAGGTGTGTGTATTTGAGCTTTTTG,AATTCAAAAAGCTCAAATACACACACCTGTTCTCGAGAACAGGTGTGTGTATTTGAGC,n/a
human,150684,COMMD1,XM_011532558.2,TRCN0000414047,NM_152516.2-230s21c1,GGCATTCTTGACTGCTCAAAC,pLKO_005,254,CDS,100,100,10.8,6.48,N,150684,COMMD1,CCGGGGCATTCTTGACTGCTCAAACCTCGAGGTTTGAGCAGTCAAGAATGCCTTTTTG,AATTCAAAAAGGCATTCTTGACTGCTCAAACCTCGAGGTTTGAGCAGTCAAGAATGCC,n/a
human,150684,COMMD1,XM_011532558.2,TRCN0000167998,NM_152516.1-277s1c1,CAAGCTGCTGTCATTTCCAAA,pLKO.1,303,CDS,100,100,4.95,2.97,N,150684,COMMD1,CCGGCAAGCTGCTGTCATTTCCAAACTCGAGTTTGGAAATGACAGCAGCTTGTTTTTG,AATTCAAAAACAAGCTGCTGTCATTTCCAAACTCGAGTTTGGAAATGACAGCAGCTTG,n/a
human,150684,COMMD1,XM_011532558.2,TRCN0000198291,NM_144514.1-883s1c1,GTCTATTGCATCTGCAGACAT,pLKO.1,215,CDS,95,95,,,N,17846,Commd1,CCGGGTCTATTGCATCTGCAGACATCTCGAGATGTCTGCAGATGCAATAGACTTTTTG,AATTCAAAAAGTCTATTGCATCTGCAGACATCTCGAGATGTCTGCAGATGCAATAGAC,n/a
human,150684,COMMD1,XM_011532558.2,TRCN0000337931,NM_144514.2-206s21c1,GTCTATTGCATCTGCAGACAT,pLKO_005,215,CDS,95,95,,,N,17846,Commd1,CCGGGTCTATTGCATCTGCAGACATCTCGAGATGTCTGCAGATGCAATAGACTTTTTG,AATTCAAAAAGTCTATTGCATCTGCAGACATCTCGAGATGTCTGCAGATGCAATAGAC,n/a
human,150684,COMMD1,XM_011532558.2,TRCN0000135735,NM_052928.1-3135s1c1,CCAGACTCCATCTCAAAGAAA,pLKO.1,637,3UTR,90,89,,,Y,114826,SMYD4,CCGGCCAGACTCCATCTCAAAGAAACTCGAGTTTCTTTGAGATGGAGTCTGGTTTTTG,AATTCAAAAACCAGACTCCATCTCAAAGAAACTCGAGTTTCTTTGAGATGGAGTCTGG,n/a
human,150684,COMMD1,XM_011532558.2,TRCN0000000449,NM_001106.x-1126s1c1,CAACTTCCAGAGAGATGCCTT,pLKO.1,1745,3UTR,85,89,,,Y,93,ACVR2B,CCGGCAACTTCCAGAGAGATGCCTTCTCGAGAAGGCATCTCTCTGGAAGTTGTTTTTG,AATTCAAAAACAACTTCCAGAGAGATGCCTTCTCGAGAAGGCATCTCTCTGGAAGTTG,n/a
human,150684,COMMD1,XM_011532558.2,TRCN0000163920,NM_001009615.1-1178s1c1,GACTCATCTGAAGGATCTTCA,pLKO.1,601,3UTR,85,89,,,Y,494119,SPANXN2,CCGGGACTCATCTGAAGGATCTTCACTCGAGTGAAGATCCTTCAGATGAGTCTTTTTG,AATTCAAAAAGACTCATCTGAAGGATCTTCACTCGAGTGAAGATCCTTCAGATGAGTC,n/a
human,150684,COMMD1,XM_011532558.2,TRCN0000584474,,TCACAGTGGTCCAGTTGAATA,pLKO_005,1369,3UTR,80,89,,,Y,81448,OR6K2,CCGGTCACAGTGGTCCAGTTGAATACTCGAGTATTCAACTGGACCACTGTGATTTTTG,AATTCAAAAATCACAGTGGTCCAGTTGAATACTCGAGTATTCAACTGGACCACTGTGA,n/a
human,150684,COMMD1,XM_011532558.2,TRCN0000248414,NM_176963.4-495s21c1,GCCAAAGGAAGATTCACTATA,pLKO_005,551,3UTR,80,89,,,Y,319625,Galm,CCGGGCCAAAGGAAGATTCACTATACTCGAGTATAGTGAATCTTCCTTTGGCTTTTTG,AATTCAAAAAGCCAAAGGAAGATTCACTATACTCGAGTATAGTGAATCTTCCTTTGGC,n/a
human,150684,COMMD1,XM_011532558.2,TRCN0000037130,XM_357921.1-139s1c1,GAGCAGGAGAGAAGAAAGAAA,pLKO.1,1869,3UTR,80,89,,,Y,384890,LOC384890,CCGGGAGCAGGAGAGAAGAAAGAAACTCGAGTTTCTTTCTTCTCTCCTGCTCTTTTTG,AATTCAAAAAGAGCAGGAGAGAAGAAAGAAACTCGAGTTTCTTTCTTCTCTCCTGCTC,n/a
human,150684,COMMD1,XM_011532558.2,TRCN0000182531,NM_027963.1-918s1c1,GCAAGGTGGTATCACCTCTAT,pLKO.1,281,CDS,80,89,,,Y,71860,Cfap52,CCGGGCAAGGTGGTATCACCTCTATCTCGAGATAGAGGTGATACCACCTTGCTTTTTG,AATTCAAAAAGCAAGGTGGTATCACCTCTATCTCGAGATAGAGGTGATACCACCTTGC,n/a
human,150684,COMMD1,XM_011532558.2,TRCN0000138934,NM_002823.2-365s1c1,GAAGAGGAGGAGGAAGAAGAA,pLKO.1,1866,3UTR,81,85,,,Y,5757,PTMA,CCGGGAAGAGGAGGAGGAAGAAGAACTCGAGTTCTTCTTCCTCCTCCTCTTCTTTTTG,AATTCAAAAAGAAGAGGAGGAGGAAGAAGAACTCGAGTTCTTCTTCCTCCTCCTCTTC,n/a
human,150684,COMMD1,XM_011532558.2,TRCN0000071758,NM_013558.1-1522s1c1,CGCTTTGACTTGACTGGAATA,pLKO.1,1465,3UTR,77,85,,,Y,15482,Hspa1l,CCGGCGCTTTGACTTGACTGGAATACTCGAGTATTCCAGTCAAGTCAAAGCGTTTTTG,AATTCAAAAACGCTTTGACTTGACTGGAATACTCGAGTATTCCAGTCAAGTCAAAGCG,n/a
human,150684,COMMD1,XM_011532558.2,TRCN0000338251,NM_001293.2-596s21c1,CACCTATGAAGAAGGATTATC,pLKO_005,894,3UTR,77,85,,,Y,1207,CLNS1A,CCGGCACCTATGAAGAAGGATTATCCTCGAGGATAATCCTTCTTCATAGGTGTTTTTG,AATTCAAAAACACCTATGAAGAAGGATTATCCTCGAGGATAATCCTTCTTCATAGGTG,n/a
human,150684,COMMD1,XM_011532558.2,TRCN0000060151,NM_003003.1-1680s1c1,GTTCCTCATTTATGCAGGAAA,pLKO.1,1222,3UTR,77,85,,,Y,6397,SEC14L1,CCGGGTTCCTCATTTATGCAGGAAACTCGAGTTTCCTGCATAAATGAGGAACTTTTTG,AATTCAAAAAGTTCCTCATTTATGCAGGAAACTCGAGTTTCCTGCATAAATGAGGAAC,n/a
human,150684,COMMD1,XM_011532558.2,TRCN0000299468,NM_003003.3-1644s21c1,GTTCCTCATTTATGCAGGAAA,pLKO_005,1222,3UTR,77,85,,,Y,6397,SEC14L1,CCGGGTTCCTCATTTATGCAGGAAACTCGAGTTTCCTGCATAAATGAGGAACTTTTTG,AATTCAAAAAGTTCCTCATTTATGCAGGAAACTCGAGTTTCCTGCATAAATGAGGAAC,n/a
human,150684,COMMD1,XM_011532558.2,TRCN0000134642,NM_015658.1-1990s1c1,GAGGACAGGAAGCAATTTAAA,pLKO.1,2078,3UTR,77,85,,,Y,26155,NOC2L,CCGGGAGGACAGGAAGCAATTTAAACTCGAGTTTAAATTGCTTCCTGTCCTCTTTTTG,AATTCAAAAAGAGGACAGGAAGCAATTTAAACTCGAGTTTAAATTGCTTCCTGTCCTC,n/a
human,150684,COMMD1,XM_011532558.2,TRCN0000189816,NM_153680.1-636s1c1,GCAGGAGTTTGAACTGCCTTA,pLKO.1,2145,3UTR,77,85,,,Y,266781,Snx17,CCGGGCAGGAGTTTGAACTGCCTTACTCGAGTAAGGCAGTTCAAACTCCTGCTTTTTG,AATTCAAAAAGCAGGAGTTTGAACTGCCTTACTCGAGTAAGGCAGTTCAAACTCCTGC,n/a
