Taxon,"Gene ID","Gene Symbol",Transcript,"Clone ID","Legacy Clone Name","Target Seq",Vector,"Match Position","Match Region","Match %","SDR Match %","Intrinsic Score","Adjusted Score","Matches Other Gene in Same Taxon?","Orig. Target Gene ID","Orig. Target Gene Symbol","Forward Oligo Sequence","Reverse Oligo Sequence",Addgene
human,4121,MAN1A1,XM_011535834.3,TRCN0000359778,NM_005907.2-1305s21c1,GACTACTCTCAGCCTACTATC,pLKO_005,1178,CDS,100,100,10.8,7.56,N,4121,MAN1A1,CCGGGACTACTCTCAGCCTACTATCCTCGAGGATAGTAGGCTGAGAGTAGTCTTTTTG,AATTCAAAAAGACTACTCTCAGCCTACTATCCTCGAGGATAGTAGGCTGAGAGTAGTC,n/a
human,4121,MAN1A1,XM_011535834.3,TRCN0000055383,NM_008548.2-1428s1c1,CGAAAGAAAGCAGTGGAACTT,pLKO.1,1219,CDS,100,100,4.95,3.465,N,17155,Man1a,CCGGCGAAAGAAAGCAGTGGAACTTCTCGAGAAGTTCCACTGCTTTCTTTCGTTTTTG,AATTCAAAAACGAAAGAAAGCAGTGGAACTTCTCGAGAAGTTCCACTGCTTTCTTTCG,n/a
human,4121,MAN1A1,XM_011535834.3,TRCN0000049601,NM_005907.2-577s1c1,GCTGGTATTCAGCGCCTTCAT,pLKO.1,450,CDS,100,100,4.95,3.465,N,4121,MAN1A1,CCGGGCTGGTATTCAGCGCCTTCATCTCGAGATGAAGGCGCTGAATACCAGCTTTTTG,AATTCAAAAAGCTGGTATTCAGCGCCTTCATCTCGAGATGAAGGCGCTGAATACCAGC,n/a
human,4121,MAN1A1,XM_011535834.3,TRCN0000049602,NM_005907.2-1143s1c1,GTAACATCAAAGGAGCAACTA,pLKO.1,1016,CDS,100,100,4.95,3.465,N,4121,MAN1A1,CCGGGTAACATCAAAGGAGCAACTACTCGAGTAGTTGCTCCTTTGATGTTACTTTTTG,AATTCAAAAAGTAACATCAAAGGAGCAACTACTCGAGTAGTTGCTCCTTTGATGTTAC,n/a
human,4121,MAN1A1,XM_011535834.3,TRCN0000018471,NM_008548.2-1243s1c1,CAATAGTAGATGCCCTGGATA,pLKO.1,1034,CDS,95,95,,,N,17155,Man1a,CCGGCAATAGTAGATGCCCTGGATACTCGAGTATCCAGGGCATCTACTATTGTTTTTG,AATTCAAAAACAATAGTAGATGCCCTGGATACTCGAGTATCCAGGGCATCTACTATTG,n/a
human,4121,MAN1A1,XM_011535834.3,TRCN0000055387,NM_008548.2-659s1c1,GCTGGTGTTCAGCGCCTTCAT,pLKO.1,450,CDS,95,95,,,N,17155,Man1a,CCGGGCTGGTGTTCAGCGCCTTCATCTCGAGATGAAGGCGCTGAACACCAGCTTTTTG,AATTCAAAAAGCTGGTGTTCAGCGCCTTCATCTCGAGATGAAGGCGCTGAACACCAGC,n/a
human,4121,MAN1A1,XM_011535834.3,TRCN0000043840,NM_000453.1-2093s1c1,CCTGGATGACAACTTGGTCAA,pLKO.1,663,CDS,85,89,,,Y,6528,SLC5A5,CCGGCCTGGATGACAACTTGGTCAACTCGAGTTGACCAAGTTGTCATCCAGGTTTTTG,AATTCAAAAACCTGGATGACAACTTGGTCAACTCGAGTTGACCAAGTTGTCATCCAGG,n/a
human,4121,MAN1A1,XM_011535834.3,TRCN0000027412,NM_011823.2-1121s1c1,CCTCTTGTTATTGGAAGGAAA,pLKO.1,1388,3UTR,85,89,,,Y,23890,Gpr34,CCGGCCTCTTGTTATTGGAAGGAAACTCGAGTTTCCTTCCAATAACAAGAGGTTTTTG,AATTCAAAAACCTCTTGTTATTGGAAGGAAACTCGAGTTTCCTTCCAATAACAAGAGG,n/a
human,4121,MAN1A1,XM_011535834.3,TRCN0000177422,NM_178253.2-1585s1c1,GAAAGACAGAAATAGCTCTAA,pLKO.1,1376,3UTR,80,89,,,Y,271005,Klhdc1,CCGGGAAAGACAGAAATAGCTCTAACTCGAGTTAGAGCTATTTCTGTCTTTCTTTTTG,AATTCAAAAAGAAAGACAGAAATAGCTCTAACTCGAGTTAGAGCTATTTCTGTCTTTC,n/a
human,4121,MAN1A1,XM_011535834.3,TRCN0000162995,NM_006031.3-2206s1c1,GCAGCATGAAACTCGTCTGAA,pLKO.1,45,5UTR,80,89,,,Y,5116,PCNT,CCGGGCAGCATGAAACTCGTCTGAACTCGAGTTCAGACGAGTTTCATGCTGCTTTTTG,AATTCAAAAAGCAGCATGAAACTCGTCTGAACTCGAGTTCAGACGAGTTTCATGCTGC,n/a
human,4121,MAN1A1,XM_011535834.3,TRCN0000014693,NM_006608.1-2650s1c1,GCAACTATGATAGATGCCCAA,pLKO.1,1030,CDS,80,89,,,Y,10745,PHTF1,CCGGGCAACTATGATAGATGCCCAACTCGAGTTGGGCATCTATCATAGTTGCTTTTTG,AATTCAAAAAGCAACTATGATAGATGCCCAACTCGAGTTGGGCATCTATCATAGTTGC,n/a
