Taxon,"Gene ID","Gene Symbol",Transcript,"Clone ID","Legacy Clone Name","Target Seq",Vector,"Match Position","Match Region","Match %","SDR Match %","Intrinsic Score","Adjusted Score","Matches Other Gene in Same Taxon?","Orig. Target Gene ID","Orig. Target Gene Symbol","Forward Oligo Sequence","Reverse Oligo Sequence",Addgene
human,344387,CDKL4,XM_017003984.1,TRCN0000358262,NM_001009565.1-156s21c1,ACGTATGTTGAAGCAATTAAA,pLKO_005,1572,CDS,100,100,15,10.5,N,344387,CDKL4,CCGGACGTATGTTGAAGCAATTAAACTCGAGTTTAATTGCTTCAACATACGTTTTTTG,AATTCAAAAAACGTATGTTGAAGCAATTAAACTCGAGTTTAATTGCTTCAACATACGT,n/a
human,344387,CDKL4,XM_017003984.1,TRCN0000021522,XM_293029.3-113s1c1,CTGAAGATGATCCTGTTGTTA,pLKO.1,1529,CDS,100,100,5.625,3.9375,N,344387,CDKL4,CCGGCTGAAGATGATCCTGTTGTTACTCGAGTAACAACAGGATCATCTTCAGTTTTTG,AATTCAAAAACTGAAGATGATCCTGTTGTTACTCGAGTAACAACAGGATCATCTTCAG,n/a
human,344387,CDKL4,XM_017003984.1,TRCN0000195080,NM_001009565.1-181s1c1,CCAAATCTTGTGAACCTCATC,pLKO.1,1597,CDS,100,100,4.05,2.835,N,344387,CDKL4,CCGGCCAAATCTTGTGAACCTCATCCTCGAGGATGAGGTTCACAAGATTTGGTTTTTG,AATTCAAAAACCAAATCTTGTGAACCTCATCCTCGAGGATGAGGTTCACAAGATTTGG,n/a
human,344387,CDKL4,XM_017003984.1,TRCN0000138456,NM_001004345.1-335s1c1,CTTCAAGAATGAAGCCACGGA,pLKO.1,1332,5UTR,95,95,,,Y,440867,LOC440867,CCGGCTTCAAGAATGAAGCCACGGACTCGAGTCCGTGGCTTCATTCTTGAAGTTTTTG,AATTCAAAAACTTCAAGAATGAAGCCACGGACTCGAGTCCGTGGCTTCATTCTTGAAG,n/a
human,344387,CDKL4,XM_017003984.1,TRCN0000134339,NM_138811.3-2683s1c1,GCTGGAAAGAACTCAAATGAT,pLKO.1,1686,CDS,81,90,,,Y,136895,C7orf31,CCGGGCTGGAAAGAACTCAAATGATCTCGAGATCATTTGAGTTCTTTCCAGCTTTTTG,AATTCAAAAAGCTGGAAAGAACTCAAATGATCTCGAGATCATTTGAGTTCTTTCCAGC,n/a
human,344387,CDKL4,XM_017003984.1,TRCN0000023274,XM_355031.1-215s1c1,CGTTGTATTCAAGTGCAGAAA,pLKO.1,1464,CDS,90,89,,,N,381113,Cdkl4,CCGGCGTTGTATTCAAGTGCAGAAACTCGAGTTTCTGCACTTGAATACAACGTTTTTG,AATTCAAAAACGTTGTATTCAAGTGCAGAAACTCGAGTTTCTGCACTTGAATACAACG,n/a
human,344387,CDKL4,XM_017003984.1,TRCN0000023278,XM_355031.1-280s1c1,CTGAAGATGATCGTGTCGTTA,pLKO.1,1529,CDS,90,89,,,Y,381113,Cdkl4,CCGGCTGAAGATGATCGTGTCGTTACTCGAGTAACGACACGATCATCTTCAGTTTTTG,AATTCAAAAACTGAAGATGATCGTGTCGTTACTCGAGTAACGACACGATCATCTTCAG,n/a
human,344387,CDKL4,XM_017003984.1,TRCN0000268923,NM_001081236.1-303s21c1,TGCAGTTTAACCTAGGCAACA,pLKO_005,17,5UTR,90,89,,,Y,76792,2410131K14Rik,CCGGTGCAGTTTAACCTAGGCAACACTCGAGTGTTGCCTAGGTTAAACTGCATTTTTG,AATTCAAAAATGCAGTTTAACCTAGGCAACACTCGAGTGTTGCCTAGGTTAAACTGCA,n/a
human,344387,CDKL4,XM_017003984.1,TRCN0000263525,NM_013279.1-817s21c1,TGCTGAATGGAATGATCAAAC,pLKO_005,1710,CDS,85,89,,,Y,745,MYRF,CCGGTGCTGAATGGAATGATCAAACCTCGAGGTTTGATCATTCCATTCAGCATTTTTG,AATTCAAAAATGCTGAATGGAATGATCAAACCTCGAGGTTTGATCATTCCATTCAGCA,n/a
human,344387,CDKL4,XM_017003984.1,TRCN0000241679,NM_198107.1-372s21c1,TGCTGATGGACAGATCAAATG,pLKO_005,1710,CDS,85,89,,,Y,216154,Med16,CCGGTGCTGATGGACAGATCAAATGCTCGAGCATTTGATCTGTCCATCAGCATTTTTG,AATTCAAAAATGCTGATGGACAGATCAAATGCTCGAGCATTTGATCTGTCCATCAGCA,n/a
human,344387,CDKL4,XM_017003984.1,TRCN0000251560,NM_001081056.1-3107s21c1,CTTCAGCAGCCTGATGCTAAA,pLKO_005,1242,5UTR,85,89,,,Y,73192,Xpot,CCGGCTTCAGCAGCCTGATGCTAAACTCGAGTTTAGCATCAGGCTGCTGAAGTTTTTG,AATTCAAAAACTTCAGCAGCCTGATGCTAAACTCGAGTTTAGCATCAGGCTGCTGAAG,n/a
human,344387,CDKL4,XM_017003984.1,TRCN0000176918,NM_181397.1-2343s1c1,GCAAGAACATAGTGACATTAA,pLKO.1,214,5UTR,85,89,,,Y,76438,Rftn1,CCGGGCAAGAACATAGTGACATTAACTCGAGTTAATGTCACTATGTTCTTGCTTTTTG,AATTCAAAAAGCAAGAACATAGTGACATTAACTCGAGTTAATGTCACTATGTTCTTGC,n/a
human,344387,CDKL4,XM_017003984.1,TRCN0000192236,NM_181424.2-832s1c1,CTTGGTGAAAGAAGGAGACAA,pLKO.1,1152,5UTR,85,89,,,Y,52856,Mtg2,CCGGCTTGGTGAAAGAAGGAGACAACTCGAGTTGTCTCCTTCTTTCACCAAGTTTTTG,AATTCAAAAACTTGGTGAAAGAAGGAGACAACTCGAGTTGTCTCCTTCTTTCACCAAG,n/a
human,344387,CDKL4,XM_017003984.1,TRCN0000240766,NM_014168.2-600s21c1,GTCATTCGATACAGTAATTAT,pLKO_005,1380,5UTR,80,89,,,Y,29081,METTL5,CCGGGTCATTCGATACAGTAATTATCTCGAGATAATTACTGTATCGAATGACTTTTTG,AATTCAAAAAGTCATTCGATACAGTAATTATCTCGAGATAATTACTGTATCGAATGAC,n/a
human,344387,CDKL4,XM_017003984.1,TRCN0000165534,NM_001012717.1-362s1c1,GAGACAGGGTTTCACCATGTT,pLKO.1,1979,CDS,80,89,,,Y,,,CCGGGAGACAGGGTTTCACCATGTTCTCGAGAACATGGTGAAACCCTGTCTCTTTTTG,AATTCAAAAAGAGACAGGGTTTCACCATGTTCTCGAGAACATGGTGAAACCCTGTCTC,n/a
human,344387,CDKL4,XM_017003984.1,TRCN0000159476,NM_001012503.1-713s1c1,CAAATTCTCTTCCCAAGTCAA,pLKO.1,808,5UTR,81,85,,,Y,440050,KRTAP5-7,CCGGCAAATTCTCTTCCCAAGTCAACTCGAGTTGACTTGGGAAGAGAATTTGTTTTTG,AATTCAAAAACAAATTCTCTTCCCAAGTCAACTCGAGTTGACTTGGGAAGAGAATTTG,n/a
human,344387,CDKL4,XM_017003984.1,TRCN0000030868,NM_175482.3-619s1c1,GCTGTTATTCAGTCTCTCTTT,pLKO.1,1128,5UTR,81,85,,,Y,235323,Usp28,CCGGGCTGTTATTCAGTCTCTCTTTCTCGAGAAAGAGAGACTGAATAACAGCTTTTTG,AATTCAAAAAGCTGTTATTCAGTCTCTCTTTCTCGAGAAAGAGAGACTGAATAACAGC,n/a
human,344387,CDKL4,XM_017003984.1,TRCN0000239777,XM_890142.2-431s21c1,ATTGTTGATAGAGAAGATATG,pLKO_005,120,5UTR,77,85,,,Y,625558,Gm6600,CCGGATTGTTGATAGAGAAGATATGCTCGAGCATATCTTCTCTATCAACAATTTTTTG,AATTCAAAAAATTGTTGATAGAGAAGATATGCTCGAGCATATCTTCTCTATCAACAAT,n/a
