Taxon,"Gene ID","Gene Symbol",Transcript,"Clone ID","Legacy Clone Name","Target Seq",Vector,"Match Position","Match Region","Match %","SDR Match %","Intrinsic Score","Adjusted Score","Matches Other Gene in Same Taxon?","Orig. Target Gene ID","Orig. Target Gene Symbol","Forward Oligo Sequence","Reverse Oligo Sequence",Addgene
human,9781,RNF144A,XM_017005400.2,TRCN0000004415,NM_014746.x-1108s1c1,CCTTCTGATACACTACGATAA,pLKO.1,1045,CDS,100,100,10.8,15.12,N,9781,RNF144A,CCGGCCTTCTGATACACTACGATAACTCGAGTTATCGTAGTGTATCAGAAGGTTTTTG,AATTCAAAAACCTTCTGATACACTACGATAACTCGAGTTATCGTAGTGTATCAGAAGG,n/a
human,9781,RNF144A,XM_017005400.2,TRCN0000421486,NM_014746.3-591s21c1,ATGTTGAGCTCTTGATCAAAG,pLKO_005,528,CDS,100,100,10.8,7.56,N,9781,RNF144A,CCGGATGTTGAGCTCTTGATCAAAGCTCGAGCTTTGATCAAGAGCTCAACATTTTTTG,AATTCAAAAAATGTTGAGCTCTTGATCAAAGCTCGAGCTTTGATCAAGAGCTCAACAT,n/a
human,9781,RNF144A,XM_017005400.2,TRCN0000004414,NM_014746.x-1099s1c1,CGATGATTTCCTTCTGATACA,pLKO.1,1036,CDS,100,100,4.95,3.465,N,9781,RNF144A,CCGGCGATGATTTCCTTCTGATACACTCGAGTGTATCAGAAGGAAATCATCGTTTTTG,AATTCAAAAACGATGATTTCCTTCTGATACACTCGAGTGTATCAGAAGGAAATCATCG,n/a
human,9781,RNF144A,XM_017005400.2,TRCN0000004413,NM_014746.x-676s1c1,GAACGAGATTGAGTGCATGGT,pLKO.1,613,CDS,100,100,2.64,1.848,N,9781,RNF144A,CCGGGAACGAGATTGAGTGCATGGTCTCGAGACCATGCACTCAATCTCGTTCTTTTTG,AATTCAAAAAGAACGAGATTGAGTGCATGGTCTCGAGACCATGCACTCAATCTCGTTC,n/a
human,9781,RNF144A,XM_017005400.2,TRCN0000421679,NM_014746.3-613s21c1,AGGATTAGAAACTGCAATTAG,pLKO_005,550,CDS,95,95,,,N,9781,RNF144A,CCGGAGGATTAGAAACTGCAATTAGCTCGAGCTAATTGCAGTTTCTAATCCTTTTTTG,AATTCAAAAAAGGATTAGAAACTGCAATTAGCTCGAGCTAATTGCAGTTTCTAATCCT,n/a
human,9781,RNF144A,XM_017005400.2,TRCN0000312929,NM_080563.3-1009s21c1,TGATTTCCTTCTGATACATTA,pLKO_005,1039,CDS,95,95,,,Y,108089,Rnf144a,CCGGTGATTTCCTTCTGATACATTACTCGAGTAATGTATCAGAAGGAAATCATTTTTG,AATTCAAAAATGATTTCCTTCTGATACATTACTCGAGTAATGTATCAGAAGGAAATCA,n/a
human,9781,RNF144A,XM_017005400.2,TRCN0000018583,NM_014240.1-1709s1c1,GTGTCATCTGTAATGAGTGTT,pLKO.1,1174,CDS,90,95,,,Y,8994,LIMD1,CCGGGTGTCATCTGTAATGAGTGTTCTCGAGAACACTCATTACAGATGACACTTTTTG,AATTCAAAAAGTGTCATCTGTAATGAGTGTTCTCGAGAACACTCATTACAGATGACAC,n/a
human,9781,RNF144A,XM_017005400.2,TRCN0000272187,NM_001099321.1-3022s21c1,CTATCAATTAGGATGCTATTT,pLKO_005,2066,3UTR,90,89,,,N,100040635,Gm15023,CCGGCTATCAATTAGGATGCTATTTCTCGAGAAATAGCATCCTAATTGATAGTTTTTG,AATTCAAAAACTATCAATTAGGATGCTATTTCTCGAGAAATAGCATCCTAATTGATAG,n/a
human,9781,RNF144A,XM_017005400.2,TRCN0000201293,NM_001024205.1-882s1c1,GAATGCGAGTAGATGGTTCAA,pLKO.1,2004,3UTR,90,89,,,N,68564,Nufip2,CCGGGAATGCGAGTAGATGGTTCAACTCGAGTTGAACCATCTACTCGCATTCTTTTTG,AATTCAAAAAGAATGCGAGTAGATGGTTCAACTCGAGTTGAACCATCTACTCGCATTC,n/a
human,9781,RNF144A,XM_017005400.2,TRCN0000083910,NM_052995.2-476s1c1,CTCTGCCATCCTTATTGTGTT,pLKO.1,1568,3UTR,85,89,,,Y,7401,CLRN1,CCGGCTCTGCCATCCTTATTGTGTTCTCGAGAACACAATAAGGATGGCAGAGTTTTTG,AATTCAAAAACTCTGCCATCCTTATTGTGTTCTCGAGAACACAATAAGGATGGCAGAG,n/a
human,9781,RNF144A,XM_017005400.2,TRCN0000138655,NM_021942.4-2041s1c1,CCAAGCTCTGTGTCAGCTTTA,pLKO.1,727,CDS,85,89,,,Y,60684,TRAPPC11,CCGGCCAAGCTCTGTGTCAGCTTTACTCGAGTAAAGCTGACACAGAGCTTGGTTTTTG,AATTCAAAAACCAAGCTCTGTGTCAGCTTTACTCGAGTAAAGCTGACACAGAGCTTGG,n/a
human,9781,RNF144A,XM_017005400.2,TRCN0000114716,NM_138684.2-425s1c1,CCTCCAGAACTCTGAGAAATA,pLKO.1,1270,3UTR,85,89,,,Y,192200,Wfdc12,CCGGCCTCCAGAACTCTGAGAAATACTCGAGTATTTCTCAGAGTTCTGGAGGTTTTTG,AATTCAAAAACCTCCAGAACTCTGAGAAATACTCGAGTATTTCTCAGAGTTCTGGAGG,n/a
human,9781,RNF144A,XM_017005400.2,TRCN0000263078,NM_015030.1-5001s21c1,CGCATCACTTCCAGCTATAAA,pLKO_005,1380,3UTR,80,89,,,Y,285527,FRYL,CCGGCGCATCACTTCCAGCTATAAACTCGAGTTTATAGCTGGAAGTGATGCGTTTTTG,AATTCAAAAACGCATCACTTCCAGCTATAAACTCGAGTTTATAGCTGGAAGTGATGCG,n/a
human,9781,RNF144A,XM_017005400.2,TRCN0000038492,NM_182632.1-1614s1c1,GAAACGGTTCTGCGATGACAT,pLKO.1,366,5UTR,80,89,,,Y,348932,SLC6A18,CCGGGAAACGGTTCTGCGATGACATCTCGAGATGTCATCGCAGAACCGTTTCTTTTTG,AATTCAAAAAGAAACGGTTCTGCGATGACATCTCGAGATGTCATCGCAGAACCGTTTC,n/a
human,9781,RNF144A,XM_017005400.2,TRCN0000083911,NM_052995.2-477s1c1,TCTGCCATCCTTATTGTGTTA,pLKO.1,1569,3UTR,80,89,,,Y,7401,CLRN1,CCGGTCTGCCATCCTTATTGTGTTACTCGAGTAACACAATAAGGATGGCAGATTTTTG,AATTCAAAAATCTGCCATCCTTATTGTGTTACTCGAGTAACACAATAAGGATGGCAGA,n/a
human,9781,RNF144A,XM_017005400.2,TRCN0000047325,NM_002045.2-718s1c1,TGTAGATGAAACCAAACCTAA,pLKO.1,2097,3UTR,80,89,,,Y,2596,GAP43,CCGGTGTAGATGAAACCAAACCTAACTCGAGTTAGGTTTGGTTTCATCTACATTTTTG,AATTCAAAAATGTAGATGAAACCAAACCTAACTCGAGTTAGGTTTGGTTTCATCTACA,n/a
human,9781,RNF144A,XM_017005400.2,TRCN0000430040,NM_198297.3-498s21c1,AGAAAGTTTCCCACCAGATAA,pLKO_005,1224,3UTR,80,89,,,Y,77647,Trat1,CCGGAGAAAGTTTCCCACCAGATAACTCGAGTTATCTGGTGGGAAACTTTCTTTTTTG,AATTCAAAAAAGAAAGTTTCCCACCAGATAACTCGAGTTATCTGGTGGGAAACTTTCT,n/a
human,9781,RNF144A,XM_017005400.2,TRCN0000239617,XM_001480385.1-492s21c1,CTGTAAGAGTGGAATTGATAT,pLKO_005,1181,CDS,80,89,,,Y,,,CCGGCTGTAAGAGTGGAATTGATATCTCGAGATATCAATTCCACTCTTACAGTTTTTG,AATTCAAAAACTGTAAGAGTGGAATTGATATCTCGAGATATCAATTCCACTCTTACAG,n/a
human,9781,RNF144A,XM_017005400.2,TRCN0000098257,NM_026146.2-94s1c1,CCAAGTGCAAAGTCTATCTAT,pLKO.1,936,CDS,80,89,,,Y,67425,Eps8l1,CCGGCCAAGTGCAAAGTCTATCTATCTCGAGATAGATAGACTTTGCACTTGGTTTTTG,AATTCAAAAACCAAGTGCAAAGTCTATCTATCTCGAGATAGATAGACTTTGCACTTGG,n/a
human,9781,RNF144A,XM_017005400.2,TRCN0000100731,NM_008851.1-3737s1c1,GCTACTTGATTGTGTATGTAA,pLKO.1,1572,3UTR,80,89,,,Y,18739,Pitpnm1,CCGGGCTACTTGATTGTGTATGTAACTCGAGTTACATACACAATCAAGTAGCTTTTTG,AATTCAAAAAGCTACTTGATTGTGTATGTAACTCGAGTTACATACACAATCAAGTAGC,n/a
human,9781,RNF144A,XM_017005400.2,TRCN0000273803,NM_011170.2-583s21c1,GAGCAGGCCCATGATCCATTT,pLKO_005,157,5UTR,81,85,,,Y,19122,Prnp,CCGGGAGCAGGCCCATGATCCATTTCTCGAGAAATGGATCATGGGCCTGCTCTTTTTG,AATTCAAAAAGAGCAGGCCCATGATCCATTTCTCGAGAAATGGATCATGGGCCTGCTC,n/a
human,9781,RNF144A,XM_017005400.2,TRCN0000140460,NM_138399.2-687s1c1,GAAGACATTTCCCTCCATCCA,pLKO.1,331,5UTR,81,85,,,Y,93109,TMEM44,CCGGGAAGACATTTCCCTCCATCCACTCGAGTGGATGGAGGGAAATGTCTTCTTTTTG,AATTCAAAAAGAAGACATTTCCCTCCATCCACTCGAGTGGATGGAGGGAAATGTCTTC,n/a
human,9781,RNF144A,XM_017005400.2,TRCN0000296819,NM_052934.3-2276s21c1,TAGAATGCAAGCACGTCTTTC,pLKO_005,989,CDS,77,85,,,Y,115019,SLC26A9,CCGGTAGAATGCAAGCACGTCTTTCCTCGAGGAAAGACGTGCTTGCATTCTATTTTTG,AATTCAAAAATAGAATGCAAGCACGTCTTTCCTCGAGGAAAGACGTGCTTGCATTCTA,n/a
human,9781,RNF144A,XM_017005400.2,TRCN0000034547,XM_377028.1-205s1c1,CATTCTCCATATCCTGAAGAA,pLKO.1,1150,CDS,77,85,,,Y,401606,LOC401606,CCGGCATTCTCCATATCCTGAAGAACTCGAGTTCTTCAGGATATGGAGAATGTTTTTG,AATTCAAAAACATTCTCCATATCCTGAAGAACTCGAGTTCTTCAGGATATGGAGAATG,n/a
human,9781,RNF144A,XM_017005400.2,TRCN0000183251,NM_001007590.2-350s1c1,GAGAAATGCATTCCCATTCAT,pLKO.1,1142,CDS,77,85,,,Y,100503884,Ccdc149,CCGGGAGAAATGCATTCCCATTCATCTCGAGATGAATGGGAATGCATTTCTCTTTTTG,AATTCAAAAAGAGAAATGCATTCCCATTCATCTCGAGATGAATGGGAATGCATTTCTC,n/a
