Taxon,"Gene ID","Gene Symbol",Transcript,"Clone ID","Legacy Clone Name","Target Seq",Vector,"Match Position","Match Region","Match %","SDR Match %","Intrinsic Score","Adjusted Score","Matches Other Gene in Same Taxon?","Orig. Target Gene ID","Orig. Target Gene Symbol","Forward Oligo Sequence","Reverse Oligo Sequence",Addgene
human,9542,NRG2,XM_017010064.2,TRCN0000058864,NM_004883.1-2239s1c1,CGCAGCTATGACAGCTACTAT,pLKO.1,1036,CDS,100,100,5.625,7.875,N,9542,NRG2,CCGGCGCAGCTATGACAGCTACTATCTCGAGATAGTAGCTGTCATAGCTGCGTTTTTG,AATTCAAAAACGCAGCTATGACAGCTACTATCTCGAGATAGTAGCTGTCATAGCTGCG,n/a
human,9542,NRG2,XM_017010064.2,TRCN0000438742,NM_004883.1-2067s21c1,GGTGCCAACTTTCGAGATCAC,pLKO_005,864,CDS,100,100,4.05,5.67,N,9542,NRG2,CCGGGGTGCCAACTTTCGAGATCACCTCGAGGTGATCTCGAAAGTTGGCACCTTTTTG,AATTCAAAAAGGTGCCAACTTTCGAGATCACCTCGAGGTGATCTCGAAAGTTGGCACC,n/a
human,9542,NRG2,XM_017010064.2,TRCN0000058867,NM_004883.1-1270s1c1,GCCAAGTCCTATTGCGTCAAT,pLKO.1,144,5UTR,100,100,4.95,2.97,N,9542,NRG2,CCGGGCCAAGTCCTATTGCGTCAATCTCGAGATTGACGCAATAGGACTTGGCTTTTTG,AATTCAAAAAGCCAAGTCCTATTGCGTCAATCTCGAGATTGACGCAATAGGACTTGGC,n/a
human,9542,NRG2,XM_017010064.2,TRCN0000097700,NM_133769.1-3865s1c1,GCAGACCTTCAACCTGGAGGA,pLKO.1,703,CDS,90,89,,,Y,76884,Cyfip2,CCGGGCAGACCTTCAACCTGGAGGACTCGAGTCCTCCAGGTTGAAGGTCTGCTTTTTG,AATTCAAAAAGCAGACCTTCAACCTGGAGGACTCGAGTCCTCCAGGTTGAAGGTCTGC,n/a
human,9542,NRG2,XM_017010064.2,TRCN0000085854,NM_020589.1-1128s1c1,CGAGAAACGTTTCCGCAAGAA,pLKO.1,2214,3UTR,85,89,,,N,68910,Zfp467,CCGGCGAGAAACGTTTCCGCAAGAACTCGAGTTCTTGCGGAAACGTTTCTCGTTTTTG,AATTCAAAAACGAGAAACGTTTCCGCAAGAACTCGAGTTCTTGCGGAAACGTTTCTCG,n/a
human,9542,NRG2,XM_017010064.2,TRCN0000010379,NM_000245.x-4571s1c1,CATCAGAACCAGAGGCTTGGT,pLKO.1,367,CDS,85,89,,,Y,4233,MET,CCGGCATCAGAACCAGAGGCTTGGTCTCGAGACCAAGCCTCTGGTTCTGATGTTTTTG,AATTCAAAAACATCAGAACCAGAGGCTTGGTCTCGAGACCAAGCCTCTGGTTCTGATG,n/a
human,9542,NRG2,XM_017010064.2,TRCN0000056425,NM_203458.2-738s1c1,CCAACCAGTTCTCCTGCAAAT,pLKO.1,193,CDS,85,89,,,Y,388677,NOTCH2NLA,CCGGCCAACCAGTTCTCCTGCAAATCTCGAGATTTGCAGGAGAACTGGTTGGTTTTTG,AATTCAAAAACCAACCAGTTCTCCTGCAAATCTCGAGATTTGCAGGAGAACTGGTTGG,n/a
human,9542,NRG2,XM_017010064.2,TRCN0000315755,NM_203458.3-741s21c1,CCAACCAGTTCTCCTGCAAAT,pLKO_005,193,CDS,85,89,,,Y,388677,NOTCH2NLA,CCGGCCAACCAGTTCTCCTGCAAATCTCGAGATTTGCAGGAGAACTGGTTGGTTTTTG,AATTCAAAAACCAACCAGTTCTCCTGCAAATCTCGAGATTTGCAGGAGAACTGGTTGG,n/a
human,9542,NRG2,XM_017010064.2,TRCN0000200614,NM_001034900.1-330s1c1,CCTTTGCATTTCAGAGTCATA,pLKO.1,2372,3UTR,85,89,,,Y,545471,Zfp345,CCGGCCTTTGCATTTCAGAGTCATACTCGAGTATGACTCTGAAATGCAAAGGTTTTTG,AATTCAAAAACCTTTGCATTTCAGAGTCATACTCGAGTATGACTCTGAAATGCAAAGG,n/a
human,9542,NRG2,XM_017010064.2,TRCN0000254379,NM_146246.3-1478s21c1,CACAACCCAGCTATGACATAT,pLKO_005,2500,3UTR,80,89,,,N,271209,Rp1l1,CCGGCACAACCCAGCTATGACATATCTCGAGATATGTCATAGCTGGGTTGTGTTTTTG,AATTCAAAAACACAACCCAGCTATGACATATCTCGAGATATGTCATAGCTGGGTTGTG,n/a
human,9542,NRG2,XM_017010064.2,TRCN0000049156,XM_292963.3-117s1c1,GAATACTGGAGAGAAAGGATT,pLKO.1,1636,3UTR,80,89,,,Y,344178,RPL5P7,CCGGGAATACTGGAGAGAAAGGATTCTCGAGAATCCTTTCTCTCCAGTATTCTTTTTG,AATTCAAAAAGAATACTGGAGAGAAAGGATTCTCGAGAATCCTTTCTCTCCAGTATTC,n/a
human,9542,NRG2,XM_017010064.2,TRCN0000431169,NM_005856.2-143s21c1,TGCAACGAGACAGGCATGTTG,pLKO_005,132,5UTR,80,89,,,Y,10268,RAMP3,CCGGTGCAACGAGACAGGCATGTTGCTCGAGCAACATGCCTGTCTCGTTGCATTTTTG,AATTCAAAAATGCAACGAGACAGGCATGTTGCTCGAGCAACATGCCTGTCTCGTTGCA,n/a
human,9542,NRG2,XM_017010064.2,TRCN0000440174,NM_005985.2-242s21c1,ATGCTCATCTGGGACTCTGTC,pLKO_005,1907,3UTR,80,89,,,Y,6615,SNAI1,CCGGATGCTCATCTGGGACTCTGTCCTCGAGGACAGAGTCCCAGATGAGCATTTTTTG,AATTCAAAAAATGCTCATCTGGGACTCTGTCCTCGAGGACAGAGTCCCAGATGAGCAT,n/a
human,9542,NRG2,XM_017010064.2,TRCN0000016357,NM_177400.1-648s1c1,GAAGCAGGACTCGGACGCCGA,pLKO.1,1551,CDS,80,89,,,Y,84504,NKX6-2,CCGGGAAGCAGGACTCGGACGCCGACTCGAGTCGGCGTCCGAGTCCTGCTTCTTTTTG,AATTCAAAAAGAAGCAGGACTCGGACGCCGACTCGAGTCGGCGTCCGAGTCCTGCTTC,n/a
human,9542,NRG2,XM_017010064.2,TRCN0000158749,NM_153038.1-844s1c1,GAGAGAAAGAAGGAAAGAAAT,pLKO.1,1644,3UTR,80,89,,,Y,151278,CCDC140,CCGGGAGAGAAAGAAGGAAAGAAATCTCGAGATTTCTTTCCTTCTTTCTCTCTTTTTG,AATTCAAAAAGAGAGAAAGAAGGAAAGAAATCTCGAGATTTCTTTCCTTCTTTCTCTC,n/a
human,9542,NRG2,XM_017010064.2,TRCN0000074628,NM_005089.1-1057s1c1,GACATCTACTTGTCTCCAGAT,pLKO.1,2514,3UTR,80,89,,,Y,8233,ZRSR2,CCGGGACATCTACTTGTCTCCAGATCTCGAGATCTGGAGACAAGTAGATGTCTTTTTG,AATTCAAAAAGACATCTACTTGTCTCCAGATCTCGAGATCTGGAGACAAGTAGATGTC,n/a
human,9542,NRG2,XM_017010064.2,TRCN0000239620,XM_001480385.1-142s21c1,CAGAACCACCTCCGCAGATAT,pLKO_005,334,CDS,77,85,,,Y,,,CCGGCAGAACCACCTCCGCAGATATCTCGAGATATCTGCGGAGGTGGTTCTGTTTTTG,AATTCAAAAACAGAACCACCTCCGCAGATATCTCGAGATATCTGCGGAGGTGGTTCTG,n/a
