Taxon,"Gene ID","Gene Symbol",Transcript,"Clone ID","Legacy Clone Name","Target Seq",Vector,"Match Position","Match Region","Match %","SDR Match %","Intrinsic Score","Adjusted Score","Matches Other Gene in Same Taxon?","Orig. Target Gene ID","Orig. Target Gene Symbol","Forward Oligo Sequence","Reverse Oligo Sequence",Addgene
human,11261,CHP1,XM_017021879.2,TRCN0000236439,NM_007236.4-385s21c1,CGTGGATTCATGCGAACTTTG,pLKO_005,468,CDS,100,100,10.8,8.64,N,11261,CHP1,CCGGCGTGGATTCATGCGAACTTTGCTCGAGCAAAGTTCGCATGAATCCACGTTTTTG,AATTCAAAAACGTGGATTCATGCGAACTTTGCTCGAGCAAAGTTCGCATGAATCCACG,n/a
human,11261,CHP1,XM_017021879.2,TRCN0000236438,NM_007236.4-276s21c1,GACTCTCAGCCGGGAAGATTT,pLKO_005,359,CDS,100,100,13.2,9.24,N,11261,CHP1,CCGGGACTCTCAGCCGGGAAGATTTCTCGAGAAATCTTCCCGGCTGAGAGTCTTTTTG,AATTCAAAAAGACTCTCAGCCGGGAAGATTTCTCGAGAAATCTTCCCGGCTGAGAGTC,n/a
human,11261,CHP1,XM_017021879.2,TRCN0000184031,NM_019769.2-280s1c1,CGGGAAGATTTCCAGAGGATT,pLKO.1,369,CDS,100,100,4.95,3.465,N,56398,Chp1,CCGGCGGGAAGATTTCCAGAGGATTCTCGAGAATCCTCTGGAAATCTTCCCGTTTTTG,AATTCAAAAACGGGAAGATTTCCAGAGGATTCTCGAGAATCCTCTGGAAATCTTCCCG,n/a
human,11261,CHP1,XM_017021879.2,TRCN0000053922,NM_007236.3-219s1c1,CAGTCAAATCACTCGCCTCTA,pLKO.1,302,CDS,100,100,4.05,2.835,N,11261,CHP1,CCGGCAGTCAAATCACTCGCCTCTACTCGAGTAGAGGCGAGTGATTTGACTGTTTTTG,AATTCAAAAACAGTCAAATCACTCGCCTCTACTCGAGTAGAGGCGAGTGATTTGACTG,n/a
human,11261,CHP1,XM_017021879.2,TRCN0000053920,NM_007236.3-372s1c1,CCAGGTAAACTTCCGTGGATT,pLKO.1,455,CDS,100,100,4.95,2.475,Y,11261,CHP1,CCGGCCAGGTAAACTTCCGTGGATTCTCGAGAATCCACGGAAGTTTACCTGGTTTTTG,AATTCAAAAACCAGGTAAACTTCCGTGGATTCTCGAGAATCCACGGAAGTTTACCTGG,n/a
human,11261,CHP1,XM_017021879.2,TRCN0000264517,NM_019769.3-360s21c1,AGAGGGAGAGGATCAGGTAAA,pLKO_005,443,CDS,95,95,,,Y,56398,Chp1,CCGGAGAGGGAGAGGATCAGGTAAACTCGAGTTTACCTGATCCTCTCCCTCTTTTTTG,AATTCAAAAAAGAGGGAGAGGATCAGGTAAACTCGAGTTTACCTGATCCTCTCCCTCT,n/a
human,11261,CHP1,XM_017021879.2,TRCN0000264518,NM_019769.3-412s21c1,TTCCGACCCATTGAGGATAAC,pLKO_005,495,CDS,90,95,,,N,56398,Chp1,CCGGTTCCGACCCATTGAGGATAACCTCGAGGTTATCCTCAATGGGTCGGAATTTTTG,AATTCAAAAATTCCGACCCATTGAGGATAACCTCGAGGTTATCCTCAATGGGTCGGAA,n/a
human,11261,CHP1,XM_017021879.2,TRCN0000230313,NM_024116.2-945s21c1,ACTTAGAAGAAGAGGATATTA,pLKO_005,574,CDS,81,90,,,Y,79101,TAF1D,CCGGACTTAGAAGAAGAGGATATTACTCGAGTAATATCCTCTTCTTCTAAGTTTTTTG,AATTCAAAAAACTTAGAAGAAGAGGATATTACTCGAGTAATATCCTCTTCTTCTAAGT,n/a
human,11261,CHP1,XM_017021879.2,TRCN0000380203,NM_016440.3-1774s21c1,GGAATCCAGAACTTTCCATTT,pLKO_005,385,CDS,80,89,,,Y,51231,VRK3,CCGGGGAATCCAGAACTTTCCATTTCTCGAGAAATGGAAAGTTCTGGATTCCTTTTTG,AATTCAAAAAGGAATCCAGAACTTTCCATTTCTCGAGAAATGGAAAGTTCTGGATTCC,n/a
