Taxon,"Gene ID","Gene Symbol",Transcript,"Clone ID","Legacy Clone Name","Target Seq",Vector,"Match Position","Match Region","Match %","SDR Match %","Intrinsic Score","Adjusted Score","Matches Other Gene in Same Taxon?","Orig. Target Gene ID","Orig. Target Gene Symbol","Forward Oligo Sequence","Reverse Oligo Sequence",Addgene
human,117154,DACH2,XM_017029255.2,TRCN0000415375,NM_053281.3-1537s21c1,AGACTCTGTTGACCAACATTC,pLKO_005,1498,CDS,100,100,10.8,15.12,N,117154,DACH2,CCGGAGACTCTGTTGACCAACATTCCTCGAGGAATGTTGGTCAACAGAGTCTTTTTTG,AATTCAAAAAAGACTCTGTTGACCAACATTCCTCGAGGAATGTTGGTCAACAGAGTCT,n/a
human,117154,DACH2,XM_017029255.2,TRCN0000020813,NM_053281.2-1749s1c1,AGGAGGTAACTATTACTGTTT,pLKO.1,1880,CDS,100,100,4.95,6.93,N,117154,DACH2,CCGGAGGAGGTAACTATTACTGTTTCTCGAGAAACAGTAATAGTTACCTCCTTTTTTG,AATTCAAAAAAGGAGGTAACTATTACTGTTTCTCGAGAAACAGTAATAGTTACCTCCT,n/a
human,117154,DACH2,XM_017029255.2,TRCN0000417908,NM_053281.3-2163s21c1,CATTAGACTGACCAGTTTAAA,pLKO_005,2124,3UTR,100,100,15,10.5,N,117154,DACH2,CCGGCATTAGACTGACCAGTTTAAACTCGAGTTTAAACTGGTCAGTCTAATGTTTTTG,AATTCAAAAACATTAGACTGACCAGTTTAAACTCGAGTTTAAACTGGTCAGTCTAATG,n/a
human,117154,DACH2,XM_017029255.2,TRCN0000020809,NM_053281.2-105s1c1,CCCTCGTCTTACTCCTAATAT,pLKO.1,275,CDS,100,100,15,10.5,N,117154,DACH2,CCGGCCCTCGTCTTACTCCTAATATCTCGAGATATTAGGAGTAAGACGAGGGTTTTTG,AATTCAAAAACCCTCGTCTTACTCCTAATATCTCGAGATATTAGGAGTAAGACGAGGG,n/a
human,117154,DACH2,XM_017029255.2,TRCN0000020810,NM_053281.2-1207s1c1,CCCTCTCAGATGGATCATCAT,pLKO.1,1338,CDS,100,100,4.95,3.465,N,117154,DACH2,CCGGCCCTCTCAGATGGATCATCATCTCGAGATGATGATCCATCTGAGAGGGTTTTTG,AATTCAAAAACCCTCTCAGATGGATCATCATCTCGAGATGATGATCCATCTGAGAGGG,n/a
human,117154,DACH2,XM_017029255.2,TRCN0000020811,NM_053281.2-943s1c1,CCATTTATGATGATGCCTCAT,pLKO.1,1074,CDS,100,100,4.05,2.835,N,117154,DACH2,CCGGCCATTTATGATGATGCCTCATCTCGAGATGAGGCATCATCATAAATGGTTTTTG,AATTCAAAAACCATTTATGATGATGCCTCATCTCGAGATGAGGCATCATCATAAATGG,n/a
human,117154,DACH2,XM_017029255.2,TRCN0000020812,NM_053281.2-138s1c1,CGTGGTTAATAACCACAGCAA,pLKO.1,308,CDS,100,100,.264,.1848,N,117154,DACH2,CCGGCGTGGTTAATAACCACAGCAACTCGAGTTGCTGTGGTTATTAACCACGTTTTTG,AATTCAAAAACGTGGTTAATAACCACAGCAACTCGAGTTGCTGTGGTTATTAACCACG,n/a
human,117154,DACH2,XM_017029255.2,TRCN0000108578,NM_033605.2-1400s1c1,CCTCGCAGATGGATCATCATT,pLKO.1,1339,CDS,95,95,,,N,93837,Dach2,CCGGCCTCGCAGATGGATCATCATTCTCGAGAATGATGATCCATCTGCGAGGTTTTTG,AATTCAAAAACCTCGCAGATGGATCATCATTCTCGAGAATGATGATCCATCTGCGAGG,n/a
human,117154,DACH2,XM_017029255.2,TRCN0000164757,NM_198571.1-2044s1c1,CCAGAGAGAGAGAGAGTGATA,pLKO.1,72,5UTR,85,95,,,Y,375607,NAT16,CCGGCCAGAGAGAGAGAGAGTGATACTCGAGTATCACTCTCTCTCTCTCTGGTTTTTG,AATTCAAAAACCAGAGAGAGAGAGAGTGATACTCGAGTATCACTCTCTCTCTCTCTGG,n/a
human,117154,DACH2,XM_017029255.2,TRCN0000198846,NM_026964.2-127s1c1,CAAGAAACAGAAGGAGCTGGA,pLKO.1,1575,CDS,85,95,,,Y,234388,Ccdc124,CCGGCAAGAAACAGAAGGAGCTGGACTCGAGTCCAGCTCCTTCTGTTTCTTGTTTTTG,AATTCAAAAACAAGAAACAGAAGGAGCTGGACTCGAGTCCAGCTCCTTCTGTTTCTTG,n/a
human,117154,DACH2,XM_017029255.2,TRCN0000423706,NM_033605.2-527s21c1,AGCTGAAGAGACTCGACATAT,pLKO_005,505,CDS,90,89,,,Y,93837,Dach2,CCGGAGCTGAAGAGACTCGACATATCTCGAGATATGTCGAGTCTCTTCAGCTTTTTTG,AATTCAAAAAAGCTGAAGAGACTCGACATATCTCGAGATATGTCGAGTCTCTTCAGCT,n/a
human,117154,DACH2,XM_017029255.2,TRCN0000422179,NM_033605.2-2108s21c1,TACTTGTGATTCCAGTATATC,pLKO_005,1963,3UTR,90,89,,,Y,93837,Dach2,CCGGTACTTGTGATTCCAGTATATCCTCGAGGATATACTGGAATCACAAGTATTTTTG,AATTCAAAAATACTTGTGATTCCAGTATATCCTCGAGGATATACTGGAATCACAAGTA,n/a
human,117154,DACH2,XM_017029255.2,TRCN0000144631,NM_018246.1-659s1c1,GATGGCAATGATTCAGATGAA,pLKO.1,1133,CDS,90,89,,,Y,55246,CCDC25,CCGGGATGGCAATGATTCAGATGAACTCGAGTTCATCTGAATCATTGCCATCTTTTTG,AATTCAAAAAGATGGCAATGATTCAGATGAACTCGAGTTCATCTGAATCATTGCCATC,n/a
human,117154,DACH2,XM_017029255.2,TRCN0000016900,NM_024336.1-965s1c1,GCGCCTCAAGAAGGAGAATAA,pLKO.1,1682,CDS,90,89,,,Y,79191,IRX3,CCGGGCGCCTCAAGAAGGAGAATAACTCGAGTTATTCTCCTTCTTGAGGCGCTTTTTG,AATTCAAAAAGCGCCTCAAGAAGGAGAATAACTCGAGTTATTCTCCTTCTTGAGGCGC,n/a
human,117154,DACH2,XM_017029255.2,TRCN0000117722,NM_014303.2-1931s1c1,AGTCACTTCTCCTCCTCCTTT,pLKO.1,1251,CDS,85,89,,,Y,23481,PES1,CCGGAGTCACTTCTCCTCCTCCTTTCTCGAGAAAGGAGGAGGAGAAGTGACTTTTTTG,AATTCAAAAAAGTCACTTCTCCTCCTCCTTTCTCGAGAAAGGAGGAGGAGAAGTGACT,n/a
human,117154,DACH2,XM_017029255.2,TRCN0000300648,NM_014303.2-1931s21c1,AGTCACTTCTCCTCCTCCTTT,pLKO_005,1251,CDS,85,89,,,Y,23481,PES1,CCGGAGTCACTTCTCCTCCTCCTTTCTCGAGAAAGGAGGAGGAGAAGTGACTTTTTTG,AATTCAAAAAAGTCACTTCTCCTCCTCCTTTCTCGAGAAAGGAGGAGGAGAAGTGACT,n/a
human,117154,DACH2,XM_017029255.2,TRCN0000009104,NM_000869.1-893s1c1,GCAGTAACTACTATGCAGAAA,pLKO.1,1663,CDS,85,89,,,Y,3359,HTR3A,CCGGGCAGTAACTACTATGCAGAAACTCGAGTTTCTGCATAGTAGTTACTGCTTTTTG,AATTCAAAAAGCAGTAACTACTATGCAGAAACTCGAGTTTCTGCATAGTAGTTACTGC,n/a
human,117154,DACH2,XM_017029255.2,TRCN0000362601,NM_008601.3-360s21c1,TATGGCTATGCTCACTCTTAA,pLKO_005,824,CDS,85,89,,,Y,17342,Mitf,CCGGTATGGCTATGCTCACTCTTAACTCGAGTTAAGAGTGAGCATAGCCATATTTTTG,AATTCAAAAATATGGCTATGCTCACTCTTAACTCGAGTTAAGAGTGAGCATAGCCATA,n/a
human,117154,DACH2,XM_017029255.2,TRCN0000120108,NM_028749.1-976s1c1,CCAAGCTAAAGAGCCTGGATT,pLKO.1,502,CDS,85,89,,,Y,74091,Npl,CCGGCCAAGCTAAAGAGCCTGGATTCTCGAGAATCCAGGCTCTTTAGCTTGGTTTTTG,AATTCAAAAACCAAGCTAAAGAGCCTGGATTCTCGAGAATCCAGGCTCTTTAGCTTGG,n/a
human,117154,DACH2,XM_017029255.2,TRCN0000305311,NM_001081223.1-1772s21c1,ACTTAAGCAAGCCACTATTTA,pLKO_005,1769,CDS,80,89,,,N,225182,Rbbp8,CCGGACTTAAGCAAGCCACTATTTACTCGAGTAAATAGTGGCTTGCTTAAGTTTTTTG,AATTCAAAAAACTTAAGCAAGCCACTATTTACTCGAGTAAATAGTGGCTTGCTTAAGT,n/a
human,117154,DACH2,XM_017029255.2,TRCN0000017163,NM_080725.1-417s1c1,AGTCCACTCTCTCAGACCTAA,pLKO.1,1200,CDS,80,89,,,Y,140809,SRXN1,CCGGAGTCCACTCTCTCAGACCTAACTCGAGTTAGGTCTGAGAGAGTGGACTTTTTTG,AATTCAAAAAAGTCCACTCTCTCAGACCTAACTCGAGTTAGGTCTGAGAGAGTGGACT,n/a
human,117154,DACH2,XM_017029255.2,TRCN0000014070,NM_016944.1-705s1c1,CCTCATCCTCTACATTCCATA,pLKO.1,1089,CDS,80,89,,,Y,50832,TAS2R4,CCGGCCTCATCCTCTACATTCCATACTCGAGTATGGAATGTAGAGGATGAGGTTTTTG,AATTCAAAAACCTCATCCTCTACATTCCATACTCGAGTATGGAATGTAGAGGATGAGG,n/a
human,117154,DACH2,XM_017029255.2,TRCN0000158924,NM_001004299.1-810s1c1,GCAGTTAAGCTTGAAAGCATT,pLKO.1,1647,CDS,80,89,,,Y,124149,ANKRD26P1,CCGGGCAGTTAAGCTTGAAAGCATTCTCGAGAATGCTTTCAAGCTTAACTGCTTTTTG,AATTCAAAAAGCAGTTAAGCTTGAAAGCATTCTCGAGAATGCTTTCAAGCTTAACTGC,n/a
human,117154,DACH2,XM_017029255.2,TRCN0000138251,NM_025043.1-308s1c1,CCAAACCTCAATCCACTGGTT,pLKO.1,1020,CDS,80,89,,,Y,,,CCGGCCAAACCTCAATCCACTGGTTCTCGAGAACCAGTGGATTGAGGTTTGGTTTTTG,AATTCAAAAACCAAACCTCAATCCACTGGTTCTCGAGAACCAGTGGATTGAGGTTTGG,n/a
human,117154,DACH2,XM_017029255.2,TRCN0000360357,NM_010455.2-1537s21c1,CAGTTCAGGACCCGACAGGAA,pLKO_005,656,CDS,80,89,,,Y,15404,Hoxa7,CCGGCAGTTCAGGACCCGACAGGAACTCGAGTTCCTGTCGGGTCCTGAACTGTTTTTG,AATTCAAAAACAGTTCAGGACCCGACAGGAACTCGAGTTCCTGTCGGGTCCTGAACTG,n/a
human,117154,DACH2,XM_017029255.2,TRCN0000128785,NM_022063.1-296s1c1,CAAACTCGGAAGATGAAGCTA,pLKO.1,803,CDS,81,85,,,Y,63877,FAM204A,CCGGCAAACTCGGAAGATGAAGCTACTCGAGTAGCTTCATCTTCCGAGTTTGTTTTTG,AATTCAAAAACAAACTCGGAAGATGAAGCTACTCGAGTAGCTTCATCTTCCGAGTTTG,n/a
human,117154,DACH2,XM_017029255.2,TRCN0000180576,NM_001013607.1-75s1c1,GCACAGATTCAAGTTCACGTA,pLKO.1,1188,CDS,77,85,,,N,327956,Vmo1,CCGGGCACAGATTCAAGTTCACGTACTCGAGTACGTGAACTTGAATCTGTGCTTTTTG,AATTCAAAAAGCACAGATTCAAGTTCACGTACTCGAGTACGTGAACTTGAATCTGTGC,n/a
human,117154,DACH2,XM_017029255.2,TRCN0000264633,NM_027600.4-472s21c1,TACCAGAAATACTTCGAAATA,pLKO_005,611,CDS,77,85,,,Y,70909,4921504E06Rik,CCGGTACCAGAAATACTTCGAAATACTCGAGTATTTCGAAGTATTTCTGGTATTTTTG,AATTCAAAAATACCAGAAATACTTCGAAATACTCGAGTATTTCGAAGTATTTCTGGTA,n/a
human,117154,DACH2,XM_017029255.2,TRCN0000244530,NM_173181.3-250s21c1,GAGCTGAAGGGACTGATATTC,pLKO_005,504,CDS,77,85,,,Y,67306,Zc2hc1a,CCGGGAGCTGAAGGGACTGATATTCCTCGAGGAATATCAGTCCCTTCAGCTCTTTTTG,AATTCAAAAAGAGCTGAAGGGACTGATATTCCTCGAGGAATATCAGTCCCTTCAGCTC,n/a
human,117154,DACH2,XM_017029255.2,TRCN0000161697,NM_016217.1-1417s1c1,GAAGACTTGCGGAAGTTCATT,pLKO.1,35,5UTR,77,85,,,Y,51696,HECA,CCGGGAAGACTTGCGGAAGTTCATTCTCGAGAATGAACTTCCGCAAGTCTTCTTTTTG,AATTCAAAAAGAAGACTTGCGGAAGTTCATTCTCGAGAATGAACTTCCGCAAGTCTTC,n/a
human,117154,DACH2,XM_017029255.2,TRCN0000330263,NM_016217.2-1417s21c1,GAAGACTTGCGGAAGTTCATT,pLKO_005,35,5UTR,77,85,,,Y,51696,HECA,CCGGGAAGACTTGCGGAAGTTCATTCTCGAGAATGAACTTCCGCAAGTCTTCTTTTTG,AATTCAAAAAGAAGACTTGCGGAAGTTCATTCTCGAGAATGAACTTCCGCAAGTCTTC,n/a
