Taxon,"Gene ID","Gene Symbol",Transcript,"Clone ID","Legacy Clone Name","Target Seq",Vector,"Match Position","Match Region","Match %","SDR Match %","Intrinsic Score","Adjusted Score","Matches Other Gene in Same Taxon?","Orig. Target Gene ID","Orig. Target Gene Symbol","Forward Oligo Sequence","Reverse Oligo Sequence",Addgene
human,107984156,LOC107984156,XM_017030181.2,TRCN0000344420,NM_001039083.3-265s21c1,GTGTGGAGACAGTAGAATATA,pLKO_005,376,CDS,100,100,15,7.5,Y,100506084,ARL17B,CCGGGTGTGGAGACAGTAGAATATACTCGAGTATATTCTACTGTCTCCACACTTTTTG,AATTCAAAAAGTGTGGAGACAGTAGAATATACTCGAGTATATTCTACTGTCTCCACAC,n/a
human,107984156,LOC107984156,XM_017030181.2,TRCN0000353088,NM_001039083.3-332s21c1,CAGACCTCTGTGGCAGCATTT,pLKO_005,443,CDS,100,100,10.8,5.4,Y,100506084,ARL17B,CCGGCAGACCTCTGTGGCAGCATTTCTCGAGAAATGCTGCCACAGAGGTCTGTTTTTG,AATTCAAAAACAGACCTCTGTGGCAGCATTTCTCGAGAAATGCTGCCACAGAGGTCTG,n/a
human,107984156,LOC107984156,XM_017030181.2,TRCN0000263038,NM_001039083.3-165s21c1,CGGATTCTTATATTGAGTTTG,pLKO_005,276,CDS,100,100,10.8,5.4,Y,100506084,ARL17B,CCGGCGGATTCTTATATTGAGTTTGCTCGAGCAAACTCAATATAAGAATCCGTTTTTG,AATTCAAAAACGGATTCTTATATTGAGTTTGCTCGAGCAAACTCAATATAAGAATCCG,n/a
human,107984156,LOC107984156,XM_017030181.2,TRCN0000140294,NM_016632.1-286s1c1,GATGTTGGCAGCCACTTCAAA,pLKO.1,420,CDS,100,100,5.625,2.8125,Y,51326,ARL17A,CCGGGATGTTGGCAGCCACTTCAAACTCGAGTTTGAAGTGGCTGCCAACATCTTTTTG,AATTCAAAAAGATGTTGGCAGCCACTTCAAACTCGAGTTTGAAGTGGCTGCCAACATC,n/a
human,107984156,LOC107984156,XM_017030181.2,TRCN0000141827,NM_016632.1-156s1c1,GAGTTTGGATACAGCTGGAAA,pLKO.1,290,CDS,100,100,4.95,2.475,Y,51326,ARL17A,CCGGGAGTTTGGATACAGCTGGAAACTCGAGTTTCCAGCTGTATCCAAACTCTTTTTG,AATTCAAAAAGAGTTTGGATACAGCTGGAAACTCGAGTTTCCAGCTGTATCCAAACTC,n/a
human,107984156,LOC107984156,XM_017030181.2,TRCN0000371107,NM_001039083.3-242s21c1,TGCCGTCCCTACAGTAGGTTT,pLKO_005,353,CDS,100,100,4.95,2.475,Y,100506084,ARL17B,CCGGTGCCGTCCCTACAGTAGGTTTCTCGAGAAACCTACTGTAGGGACGGCATTTTTG,AATTCAAAAATGCCGTCCCTACAGTAGGTTTCTCGAGAAACCTACTGTAGGGACGGCA,n/a
human,107984156,LOC107984156,XM_017030181.2,TRCN0000140324,NM_016632.1-230s1c1,CAGTAGGTTTCTGTGTGGAGA,pLKO.1,364,CDS,100,100,2.64,1.32,Y,51326,ARL17A,CCGGCAGTAGGTTTCTGTGTGGAGACTCGAGTCTCCACACAGAAACCTACTGTTTTTG,AATTCAAAAACAGTAGGTTTCTGTGTGGAGACTCGAGTCTCCACACAGAAACCTACTG,n/a
human,107984156,LOC107984156,XM_017030181.2,TRCN0000100228,NM_007477.2-685s1c1,GTGGAGACAGTAGAGTACAAA,pLKO.1,378,CDS,90,89,,,Y,11841,Arf2,CCGGGTGGAGACAGTAGAGTACAAACTCGAGTTTGTACTCTACTGTCTCCACTTTTTG,AATTCAAAAAGTGGAGACAGTAGAGTACAAACTCGAGTTTGTACTCTACTGTCTCCAC,n/a
human,107984156,LOC107984156,XM_017030181.2,TRCN0000107211,NM_012454.2-3499s1c1,CCACTTCAGAATGAGACCTTT,pLKO.1,431,CDS,85,89,,,Y,26230,TIAM2,CCGGCCACTTCAGAATGAGACCTTTCTCGAGAAAGGTCTCATTCTGAAGTGGTTTTTG,AATTCAAAAACCACTTCAGAATGAGACCTTTCTCGAGAAAGGTCTCATTCTGAAGTGG,n/a
human,107984156,LOC107984156,XM_017030181.2,TRCN0000235433,NM_002831.5-2064s21c1,CTGACCCTGTGGAAGCATTTC,pLKO_005,443,CDS,81,85,,,Y,5777,PTPN6,CCGGCTGACCCTGTGGAAGCATTTCCTCGAGGAAATGCTTCCACAGGGTCAGTTTTTG,AATTCAAAAACTGACCCTGTGGAAGCATTTCCTCGAGGAAATGCTTCCACAGGGTCAG,n/a
