Taxon,"Gene ID","Gene Symbol",Transcript,"Clone ID","Legacy Clone Name","Target Seq",Vector,"Match Position","Match Region","Match %","SDR Match %","Intrinsic Score","Adjusted Score","Matches Other Gene in Same Taxon?","Orig. Target Gene ID","Orig. Target Gene Symbol","Forward Oligo Sequence","Reverse Oligo Sequence",Addgene
mouse,20350,Sema3f,XM_017313226.1,TRCN0000054577,NM_011349.2-911s1c1,GCAGAGCGCAATGACGATAAA,pLKO.1,1419,CDS,100,100,13.2,18.48,N,20350,Sema3f,CCGGGCAGAGCGCAATGACGATAAACTCGAGTTTATCGTCATTGCGCTCTGCTTTTTG,AATTCAAAAAGCAGAGCGCAATGACGATAAACTCGAGTTTATCGTCATTGCGCTCTGC,n/a
mouse,20350,Sema3f,XM_017313226.1,TRCN0000054574,NM_011349.2-299s1c1,CGACTGTCATTCAAAGAACTT,pLKO.1,714,CDS,100,100,4.95,6.93,N,20350,Sema3f,CCGGCGACTGTCATTCAAAGAACTTCTCGAGAAGTTCTTTGAATGACAGTCGTTTTTG,AATTCAAAAACGACTGTCATTCAAAGAACTTCTCGAGAAGTTCTTTGAATGACAGTCG,n/a
mouse,20350,Sema3f,XM_017313226.1,TRCN0000054573,NM_011349.2-1166s1c1,CCAGTCATTTATGCTGTCTTT,pLKO.1,1674,CDS,100,100,4.95,3.96,N,20350,Sema3f,CCGGCCAGTCATTTATGCTGTCTTTCTCGAGAAAGACAGCATAAATGACTGGTTTTTG,AATTCAAAAACCAGTCATTTATGCTGTCTTTCTCGAGAAAGACAGCATAAATGACTGG,n/a
mouse,20350,Sema3f,XM_017313226.1,TRCN0000054576,NM_011349.2-745s1c1,CCTCATCAATGAGGAACTCTA,pLKO.1,1253,CDS,100,100,.495,.3465,N,20350,Sema3f,CCGGCCTCATCAATGAGGAACTCTACTCGAGTAGAGTTCCTCATTGATGAGGTTTTTG,AATTCAAAAACCTCATCAATGAGGAACTCTACTCGAGTAGAGTTCCTCATTGATGAGG,n/a
mouse,20350,Sema3f,XM_017313226.1,TRCN0000373485,NM_004186.3-1316s21c1,TCTACTCCATGGCTGATATTC,pLKO_005,1735,CDS,95,100,13.2,9.24,N,6405,SEMA3F,CCGGTCTACTCCATGGCTGATATTCCTCGAGGAATATCAGCCATGGAGTAGATTTTTG,AATTCAAAAATCTACTCCATGGCTGATATTCCTCGAGGAATATCAGCCATGGAGTAGA,n/a
mouse,20350,Sema3f,XM_017313226.1,TRCN0000002330,NM_002755.x-1163s1c1,CTGATGCTGAGGAAGTGGATT,pLKO.1,2133,CDS,86,95,,,N,5604,MAP2K1,CCGGCTGATGCTGAGGAAGTGGATTCTCGAGAATCCACTTCCTCAGCATCAGTTTTTG,AATTCAAAAACTGATGCTGAGGAAGTGGATTCTCGAGAATCCACTTCCTCAGCATCAG,n/a
mouse,20350,Sema3f,XM_017313226.1,TRCN0000183963,NM_177913.2-1225s1c1,CCTTCCTTCATACGATGCTCT,pLKO.1,1383,CDS,85,95,,,Y,331195,A430089I19Rik,CCGGCCTTCCTTCATACGATGCTCTCTCGAGAGAGCATCGTATGAAGGAAGGTTTTTG,AATTCAAAAACCTTCCTTCATACGATGCTCTCTCGAGAGAGCATCGTATGAAGGAAGG,n/a
mouse,20350,Sema3f,XM_017313226.1,TRCN0000015400,NM_178161.1-754s1c1,CAGAAGGTCATCATCTGCCAT,pLKO.1,2088,CDS,81,90,,,Y,256297,PTF1A,CCGGCAGAAGGTCATCATCTGCCATCTCGAGATGGCAGATGATGACCTTCTGTTTTTG,AATTCAAAAACAGAAGGTCATCATCTGCCATCTCGAGATGGCAGATGATGACCTTCTG,n/a
mouse,20350,Sema3f,XM_017313226.1,TRCN0000373417,NM_004186.3-1441s21c1,GGAACCTTCACGCCATCTATG,pLKO_005,1860,CDS,90,89,,,Y,6405,SEMA3F,CCGGGGAACCTTCACGCCATCTATGCTCGAGCATAGATGGCGTGAAGGTTCCTTTTTG,AATTCAAAAAGGAACCTTCACGCCATCTATGCTCGAGCATAGATGGCGTGAAGGTTCC,n/a
mouse,20350,Sema3f,XM_017313226.1,TRCN0000373416,NM_004186.3-855s21c1,TGCTGGTGTGTACATCGATTT,pLKO_005,1274,CDS,90,89,,,Y,6405,SEMA3F,CCGGTGCTGGTGTGTACATCGATTTCTCGAGAAATCGATGTACACACCAGCATTTTTG,AATTCAAAAATGCTGGTGTGTACATCGATTTCTCGAGAAATCGATGTACACACCAGCA,n/a
mouse,20350,Sema3f,XM_017313226.1,TRCN0000061628,NM_004186.2-1255s1c1,CCTGTCATTTACGCTGTCTTT,pLKO.1,1674,CDS,90,89,,,Y,6405,SEMA3F,CCGGCCTGTCATTTACGCTGTCTTTCTCGAGAAAGACAGCGTAAATGACAGGTTTTTG,AATTCAAAAACCTGTCATTTACGCTGTCTTTCTCGAGAAAGACAGCGTAAATGACAGG,n/a
mouse,20350,Sema3f,XM_017313226.1,TRCN0000312585,NM_020414.3-2177s21c1,CTGAGGATGTGATCAACTTTA,pLKO_005,1900,CDS,85,89,,,Y,57062,DDX24,CCGGCTGAGGATGTGATCAACTTTACTCGAGTAAAGTTGATCACATCCTCAGTTTTTG,AATTCAAAAACTGAGGATGTGATCAACTTTACTCGAGTAAAGTTGATCACATCCTCAG,n/a
mouse,20350,Sema3f,XM_017313226.1,TRCN0000238534,NM_001081340.1-2442s21c1,TCAACGAAGTGGATCACATTT,pLKO_005,1549,CDS,85,89,,,Y,235626,Setd2,CCGGTCAACGAAGTGGATCACATTTCTCGAGAAATGTGATCCACTTCGTTGATTTTTG,AATTCAAAAATCAACGAAGTGGATCACATTTCTCGAGAAATGTGATCCACTTCGTTGA,n/a
mouse,20350,Sema3f,XM_017313226.1,TRCN0000087692,XM_128530.6-347s1c1,GCATGTGAGAAGTGCATACTA,pLKO.1,916,CDS,85,89,,,Y,214931,Fbxl16,CCGGGCATGTGAGAAGTGCATACTACTCGAGTAGTATGCACTTCTCACATGCTTTTTG,AATTCAAAAAGCATGTGAGAAGTGCATACTACTCGAGTAGTATGCACTTCTCACATGC,n/a
mouse,20350,Sema3f,XM_017313226.1,TRCN0000110657,NM_008749.1-766s1c1,CTGCATGACATCAACAGTGAT,pLKO.1,861,CDS,85,89,,,Y,18220,Nucb1,CCGGCTGCATGACATCAACAGTGATCTCGAGATCACTGTTGATGTCATGCAGTTTTTG,AATTCAAAAACTGCATGACATCAACAGTGATCTCGAGATCACTGTTGATGTCATGCAG,n/a
mouse,20350,Sema3f,XM_017313226.1,TRCN0000122967,NM_020812.1-1023s1c1,CCTGGTCATCAAGTTGGAGAA,pLKO.1,1544,CDS,85,89,,,Y,57572,DOCK6,CCGGCCTGGTCATCAAGTTGGAGAACTCGAGTTCTCCAACTTGATGACCAGGTTTTTG,AATTCAAAAACCTGGTCATCAAGTTGGAGAACTCGAGTTCTCCAACTTGATGACCAGG,n/a
mouse,20350,Sema3f,XM_017313226.1,TRCN0000173163,NM_028056.1-1009s1c1,CAGAGCAACTTCCAGGAGAAT,pLKO.1,2756,CDS,85,89,,,Y,72016,1600002H07Rik,CCGGCAGAGCAACTTCCAGGAGAATCTCGAGATTCTCCTGGAAGTTGCTCTGTTTTTG,AATTCAAAAACAGAGCAACTTCCAGGAGAATCTCGAGATTCTCCTGGAAGTTGCTCTG,n/a
mouse,20350,Sema3f,XM_017313226.1,TRCN0000077294,NM_022429.999-327s1c1,CCACTCATTTATGCGGTCTTA,pLKO.1,1674,CDS,85,89,,,Y,64380,Ms4a4c,CCGGCCACTCATTTATGCGGTCTTACTCGAGTAAGACCGCATAAATGAGTGGTTTTTG,AATTCAAAAACCACTCATTTATGCGGTCTTACTCGAGTAAGACCGCATAAATGAGTGG,n/a
mouse,20350,Sema3f,XM_017313226.1,TRCN0000164752,NM_058188.1-368s1c1,CCCTCACCAATAAGGAACTGT,pLKO.1,1252,CDS,85,89,,,Y,84536,LINC01547,CCGGCCCTCACCAATAAGGAACTGTCTCGAGACAGTTCCTTATTGGTGAGGGTTTTTG,AATTCAAAAACCCTCACCAATAAGGAACTGTCTCGAGACAGTTCCTTATTGGTGAGGG,n/a
mouse,20350,Sema3f,XM_017313226.1,TRCN0000270096,NM_001013764.1-1802s21c1,CCATTAGCAGCCTGGTCAATG,pLKO_005,1535,CDS,80,89,,,Y,244595,Ces1a,CCGGCCATTAGCAGCCTGGTCAATGCTCGAGCATTGACCAGGCTGCTAATGGTTTTTG,AATTCAAAAACCATTAGCAGCCTGGTCAATGCTCGAGCATTGACCAGGCTGCTAATGG,n/a
mouse,20350,Sema3f,XM_017313226.1,TRCN0000053946,NM_153214.1-1272s1c1,CCAAGACCATCTCCTTCCATT,pLKO.1,2182,CDS,80,89,,,Y,129804,FBLN7,CCGGCCAAGACCATCTCCTTCCATTCTCGAGAATGGAAGGAGATGGTCTTGGTTTTTG,AATTCAAAAACCAAGACCATCTCCTTCCATTCTCGAGAATGGAAGGAGATGGTCTTGG,n/a
mouse,20350,Sema3f,XM_017313226.1,TRCN0000079158,NM_026229.1-1561s1c1,CCTGAGATACTGGAGTCACTT,pLKO.1,1188,CDS,80,89,,,Y,67549,Gpr89,CCGGCCTGAGATACTGGAGTCACTTCTCGAGAAGTGACTCCAGTATCTCAGGTTTTTG,AATTCAAAAACCTGAGATACTGGAGTCACTTCTCGAGAAGTGACTCCAGTATCTCAGG,n/a
mouse,20350,Sema3f,XM_017313226.1,TRCN0000326034,NM_026229.4-1561s21c1,CCTGAGATACTGGAGTCACTT,pLKO_005,1188,CDS,80,89,,,Y,67549,Gpr89,CCGGCCTGAGATACTGGAGTCACTTCTCGAGAAGTGACTCCAGTATCTCAGGTTTTTG,AATTCAAAAACCTGAGATACTGGAGTCACTTCTCGAGAAGTGACTCCAGTATCTCAGG,n/a
mouse,20350,Sema3f,XM_017313226.1,TRCN0000150878,NM_031933.1-352s1c1,GACTTCCTTCATACATGCTAT,pLKO.1,1382,CDS,80,89,,,Y,7478,WNT8A,CCGGGACTTCCTTCATACATGCTATCTCGAGATAGCATGTATGAAGGAAGTCTTTTTG,AATTCAAAAAGACTTCCTTCATACATGCTATCTCGAGATAGCATGTATGAAGGAAGTC,n/a
mouse,20350,Sema3f,XM_017313226.1,TRCN0000125658,NM_025635.1-453s1c1,CGAGTCCTTGAGGAGAAACTT,pLKO.1,2651,CDS,81,85,,,Y,52696,Zwint,CCGGCGAGTCCTTGAGGAGAAACTTCTCGAGAAGTTTCTCCTCAAGGACTCGTTTTTG,AATTCAAAAACGAGTCCTTGAGGAGAAACTTCTCGAGAAGTTTCTCCTCAAGGACTCG,n/a
mouse,20350,Sema3f,XM_017313226.1,TRCN0000157084,NM_002286.4-1460s1c1,GTGACTCCAGTATCTGGACAA,pLKO.1,2871,CDS,81,85,,,Y,3902,LAG3,CCGGGTGACTCCAGTATCTGGACAACTCGAGTTGTCCAGATACTGGAGTCACTTTTTG,AATTCAAAAAGTGACTCCAGTATCTGGACAACTCGAGTTGTCCAGATACTGGAGTCAC,n/a
mouse,20350,Sema3f,XM_017313226.1,TRCN0000023651,NM_008413.1-1296s1c1,CGGCCCAATATCAATGGATTT,pLKO.1,1791,CDS,77,85,,,Y,16452,Jak2,CCGGCGGCCCAATATCAATGGATTTCTCGAGAAATCCATTGATATTGGGCCGTTTTTG,AATTCAAAAACGGCCCAATATCAATGGATTTCTCGAGAAATCCATTGATATTGGGCCG,n/a
mouse,20350,Sema3f,XM_017313226.1,TRCN0000278192,NM_008413.2-1602s21c1,CGGCCCAATATCAATGGATTT,pLKO_005,1791,CDS,77,85,,,Y,16452,Jak2,CCGGCGGCCCAATATCAATGGATTTCTCGAGAAATCCATTGATATTGGGCCGTTTTTG,AATTCAAAAACGGCCCAATATCAATGGATTTCTCGAGAAATCCATTGATATTGGGCCG,n/a
mouse,20350,Sema3f,XM_017313226.1,TRCN0000583834,,TCTTCTACCTGACCCTGATTG,pLKO_005,1174,CDS,77,85,,,Y,403244,OR2T35,CCGGTCTTCTACCTGACCCTGATTGCTCGAGCAATCAGGGTCAGGTAGAAGATTTTTG,AATTCAAAAATCTTCTACCTGACCCTGATTGCTCGAGCAATCAGGGTCAGGTAGAAGA,n/a
mouse,20350,Sema3f,XM_017313226.1,TRCN0000030542,NM_199019.1-155s1c1,CGTGTCAAAGAACTGGAGCAA,pLKO.1,568,5UTR,77,85,,,Y,237958,Sppl2c,CCGGCGTGTCAAAGAACTGGAGCAACTCGAGTTGCTCCAGTTCTTTGACACGTTTTTG,AATTCAAAAACGTGTCAAAGAACTGGAGCAACTCGAGTTGCTCCAGTTCTTTGACACG,n/a
mouse,20350,Sema3f,XM_017313226.1,TRCN0000257667,NM_011900.3-616s21c1,CAGGCCAGCTTTCAGCCATTA,pLKO_005,684,CDS,77,85,,,Y,24070,Mpdu1,CCGGCAGGCCAGCTTTCAGCCATTACTCGAGTAATGGCTGAAAGCTGGCCTGTTTTTG,AATTCAAAAACAGGCCAGCTTTCAGCCATTACTCGAGTAATGGCTGAAAGCTGGCCTG,n/a
