Taxon,"Gene ID","Gene Symbol",Transcript,"Clone ID","Legacy Clone Name","Target Seq",Vector,"Match Position","Match Region","Match %","SDR Match %","Intrinsic Score","Adjusted Score","Matches Other Gene in Same Taxon?","Orig. Target Gene ID","Orig. Target Gene Symbol","Forward Oligo Sequence","Reverse Oligo Sequence",Addgene
mouse,108699,Chn1,XM_017314894.1,TRCN0000047801,NM_001822.2-566s1c1,GCTTTAAGATTTGGAAGTCAA,pLKO.1,579,CDS,95,100,4.95,3.96,N,1123,CHN1,CCGGGCTTTAAGATTTGGAAGTCAACTCGAGTTGACTTCCAAATCTTAAAGCTTTTTG,AATTCAAAAAGCTTTAAGATTTGGAAGTCAACTCGAGTTGACTTCCAAATCTTAAAGC,n/a
mouse,108699,Chn1,XM_017314894.1,TRCN0000047799,NM_001822.2-745s1c1,GCACGTAGGATACACAACCTT,pLKO.1,758,CDS,95,95,,,N,1123,CHN1,CCGGGCACGTAGGATACACAACCTTCTCGAGAAGGTTGTGTATCCTACGTGCTTTTTG,AATTCAAAAAGCACGTAGGATACACAACCTTCTCGAGAAGGTTGTGTATCCTACGTGC,n/a
mouse,108699,Chn1,XM_017314894.1,TRCN0000333585,NM_001822.4-962s21c1,GCACGTAGGATACACAACCTT,pLKO_005,758,CDS,95,95,,,N,1123,CHN1,CCGGGCACGTAGGATACACAACCTTCTCGAGAAGGTTGTGTATCCTACGTGCTTTTTG,AATTCAAAAAGCACGTAGGATACACAACCTTCTCGAGAAGGTTGTGTATCCTACGTGC,n/a
mouse,108699,Chn1,XM_017314894.1,TRCN0000112396,NM_175752.1-756s1c1,AGGGAGTGAAATGTGCAGATT,pLKO.1,1021,3UTR,85,95,,,N,108699,Chn1,CCGGAGGGAGTGAAATGTGCAGATTCTCGAGAATCTGCACATTTCACTCCCTTTTTTG,AATTCAAAAAAGGGAGTGAAATGTGCAGATTCTCGAGAATCTGCACATTTCACTCCCT,n/a
mouse,108699,Chn1,XM_017314894.1,TRCN0000046427,NM_000637.1-1297s1c1,AGACCTATTCAACGAGCTTTA,pLKO.1,901,CDS,85,89,,,N,2936,GSR,CCGGAGACCTATTCAACGAGCTTTACTCGAGTAAAGCTCGTTGAATAGGTCTTTTTTG,AATTCAAAAAAGACCTATTCAACGAGCTTTACTCGAGTAAAGCTCGTTGAATAGGTCT,n/a
mouse,108699,Chn1,XM_017314894.1,TRCN0000135788,NM_020141.2-204s1c1,CTATCAGAGAAGAAGGGTGTT,pLKO.1,861,CDS,85,89,,,Y,56900,TMEM167B,CCGGCTATCAGAGAAGAAGGGTGTTCTCGAGAACACCCTTCTTCTCTGATAGTTTTTG,AATTCAAAAACTATCAGAGAAGAAGGGTGTTCTCGAGAACACCCTTCTTCTCTGATAG,n/a
mouse,108699,Chn1,XM_017314894.1,TRCN0000367890,NM_001005522.1-102s21c1,GACCTCCCTGTTTGGCAATTC,pLKO_005,361,CDS,80,89,,,Y,343172,OR2T8,CCGGGACCTCCCTGTTTGGCAATTCCTCGAGGAATTGCCAAACAGGGAGGTCTTTTTG,AATTCAAAAAGACCTCCCTGTTTGGCAATTCCTCGAGGAATTGCCAAACAGGGAGGTC,n/a
mouse,108699,Chn1,XM_017314894.1,TRCN0000137016,NM_022483.3-1092s1c1,CCTCTTGCTCAGGAAGTGTAT,pLKO.1,1010,3UTR,81,85,,,Y,64417,TMEM267,CCGGCCTCTTGCTCAGGAAGTGTATCTCGAGATACACTTCCTGAGCAAGAGGTTTTTG,AATTCAAAAACCTCTTGCTCAGGAAGTGTATCTCGAGATACACTTCCTGAGCAAGAGG,n/a
mouse,108699,Chn1,XM_017314894.1,TRCN0000126280,NM_026631.1-290s1c1,GCAGGAGATACATTGCCGATT,pLKO.1,714,CDS,77,85,,,Y,52530,Nhp2,CCGGGCAGGAGATACATTGCCGATTCTCGAGAATCGGCAATGTATCTCCTGCTTTTTG,AATTCAAAAAGCAGGAGATACATTGCCGATTCTCGAGAATCGGCAATGTATCTCCTGC,n/a
mouse,108699,Chn1,XM_017314894.1,TRCN0000316095,NM_026631.3-289s21c1,GCAGGAGATACATTGCCGATT,pLKO_005,714,CDS,77,85,,,Y,52530,Nhp2,CCGGGCAGGAGATACATTGCCGATTCTCGAGAATCGGCAATGTATCTCCTGCTTTTTG,AATTCAAAAAGCAGGAGATACATTGCCGATTCTCGAGAATCGGCAATGTATCTCCTGC,n/a
mouse,108699,Chn1,XM_017314894.1,TRCN0000137171,NM_016030.5-389s1c1,GCTGAACGAACACATGATGGA,pLKO.1,815,CDS,77,85,,,Y,51112,TRAPPC12,CCGGGCTGAACGAACACATGATGGACTCGAGTCCATCATGTGTTCGTTCAGCTTTTTG,AATTCAAAAAGCTGAACGAACACATGATGGACTCGAGTCCATCATGTGTTCGTTCAGC,n/a
