Taxon,"Gene ID","Gene Symbol",Transcript,"Clone ID","Legacy Clone Name","Target Seq",Vector,"Match Position","Match Region","Match %","SDR Match %","Intrinsic Score","Adjusted Score","Matches Other Gene in Same Taxon?","Orig. Target Gene ID","Orig. Target Gene Symbol","Forward Oligo Sequence","Reverse Oligo Sequence",Addgene
human,23514,SPIDR,XM_024447116.1,TRCN0000263329,NM_001080394.1-1264s21c1,GTAATTAAGGGTCTAACAAAT,pLKO_005,929,CDS,100,100,13.2,18.48,N,23514,SPIDR,CCGGGTAATTAAGGGTCTAACAAATCTCGAGATTTGTTAGACCCTTAATTACTTTTTG,AATTCAAAAAGTAATTAAGGGTCTAACAAATCTCGAGATTTGTTAGACCCTTAATTAC,n/a
human,23514,SPIDR,XM_024447116.1,TRCN0000263331,NM_001080394.1-1952s21c1,GTTTCTATGCCACGGTGATTT,pLKO_005,1617,CDS,100,100,13.2,9.24,N,23514,SPIDR,CCGGGTTTCTATGCCACGGTGATTTCTCGAGAAATCACCGTGGCATAGAAACTTTTTG,AATTCAAAAAGTTTCTATGCCACGGTGATTTCTCGAGAAATCACCGTGGCATAGAAAC,n/a
human,23514,SPIDR,XM_024447116.1,TRCN0000263332,NM_001080394.1-3028s21c1,TTGGTATTTAGGCAATATATG,pLKO_005,2694,3UTR,100,100,13.2,9.24,N,23514,SPIDR,CCGGTTGGTATTTAGGCAATATATGCTCGAGCATATATTGCCTAAATACCAATTTTTG,AATTCAAAAATTGGTATTTAGGCAATATATGCTCGAGCATATATTGCCTAAATACCAA,n/a
human,23514,SPIDR,XM_024447116.1,TRCN0000025546,NM_007590.2-385s1c1,GTCTTTGACAAGGATGGGAAT,pLKO.1,512,5UTR,86,90,,,Y,12315,Calm3,CCGGGTCTTTGACAAGGATGGGAATCTCGAGATTCCCATCCTTGTCAAAGACTTTTTG,AATTCAAAAAGTCTTTGACAAGGATGGGAATCTCGAGATTCCCATCCTTGTCAAAGAC,n/a
human,23514,SPIDR,XM_024447116.1,TRCN0000152036,NM_152439.1-1827s1c1,CCACAGTGATTTAGCCAAATA,pLKO.1,1626,CDS,85,89,,,Y,144453,BEST3,CCGGCCACAGTGATTTAGCCAAATACTCGAGTATTTGGCTAAATCACTGTGGTTTTTG,AATTCAAAAACCACAGTGATTTAGCCAAATACTCGAGTATTTGGCTAAATCACTGTGG,n/a
human,23514,SPIDR,XM_024447116.1,TRCN0000061833,NM_170707.1-885s1c1,CGACTGGTGGAGATTGACAAT,pLKO.1,404,5UTR,85,89,,,Y,4000,LMNA,CCGGCGACTGGTGGAGATTGACAATCTCGAGATTGTCAATCTCCACCAGTCGTTTTTG,AATTCAAAAACGACTGGTGGAGATTGACAATCTCGAGATTGTCAATCTCCACCAGTCG,n/a
human,23514,SPIDR,XM_024447116.1,TRCN0000058626,NM_004115.2-597s1c1,GCCATTGGAAGTTGCCATGTA,pLKO.1,605,5UTR,85,89,,,Y,2259,FGF14,CCGGGCCATTGGAAGTTGCCATGTACTCGAGTACATGGCAACTTCCAATGGCTTTTTG,AATTCAAAAAGCCATTGGAAGTTGCCATGTACTCGAGTACATGGCAACTTCCAATGGC,n/a
human,23514,SPIDR,XM_024447116.1,TRCN0000321541,NM_133759.3-1732s21c1,GGTGGCAGAATGAAGGTTCTT,pLKO_005,1321,CDS,85,89,,,Y,75291,Zbtb3,CCGGGGTGGCAGAATGAAGGTTCTTCTCGAGAAGAACCTTCATTCTGCCACCTTTTTG,AATTCAAAAAGGTGGCAGAATGAAGGTTCTTCTCGAGAAGAACCTTCATTCTGCCACC,n/a
human,23514,SPIDR,XM_024447116.1,TRCN0000096169,NM_008678.1-4625s1c1,CCACTGGGCTTACAAACATTT,pLKO.1,304,5UTR,80,89,,,Y,17978,Ncoa2,CCGGCCACTGGGCTTACAAACATTTCTCGAGAAATGTTTGTAAGCCCAGTGGTTTTTG,AATTCAAAAACCACTGGGCTTACAAACATTTCTCGAGAAATGTTTGTAAGCCCAGTGG,n/a
human,23514,SPIDR,XM_024447116.1,TRCN0000147615,NM_138807.2-1062s1c1,GAAACTTTATTCCAAGTGGCT,pLKO.1,775,CDS,78,86,,,Y,132001,TAMM41,CCGGGAAACTTTATTCCAAGTGGCTCTCGAGAGCCACTTGGAATAAAGTTTCTTTTTG,AATTCAAAAAGAAACTTTATTCCAAGTGGCTCTCGAGAGCCACTTGGAATAAAGTTTC,n/a
human,23514,SPIDR,XM_024447116.1,TRCN0000433625,NM_018656.2-1562s21c1,TGGAATGATTTGTCGGAATTA,pLKO_005,338,5UTR,81,85,,,Y,55508,SLC35E3,CCGGTGGAATGATTTGTCGGAATTACTCGAGTAATTCCGACAAATCATTCCATTTTTG,AATTCAAAAATGGAATGATTTGTCGGAATTACTCGAGTAATTCCGACAAATCATTCCA,n/a
