Taxon,"Gene ID","Gene Symbol",Transcript,"Clone ID","Legacy Clone Name","Target Seq",Vector,"Match Position","Match Region","Match %","SDR Match %","Intrinsic Score","Adjusted Score","Matches Other Gene in Same Taxon?","Orig. Target Gene ID","Orig. Target Gene Symbol","Forward Oligo Sequence","Reverse Oligo Sequence",Addgene
human,9379,NRXN2,XM_024448774.1,TRCN0000139408,NM_015080.2-4092s1c1,CCATAGTAAGCGACGGCAAAT,pLKO.1,462,CDS,100,100,10.8,15.12,N,9379,NRXN2,CCGGCCATAGTAAGCGACGGCAAATCTCGAGATTTGCCGTCGCTTACTATGGTTTTTG,AATTCAAAAACCATAGTAAGCGACGGCAAATCTCGAGATTTGCCGTCGCTTACTATGG,n/a
human,9379,NRXN2,XM_024448774.1,TRCN0000446907,NM_015080.2-5833s21c1,CTCACAGCCCTGGGTTGATTT,pLKO_005,2113,3UTR,100,100,13.2,10.56,N,9379,NRXN2,CCGGCTCACAGCCCTGGGTTGATTTCTCGAGAAATCAACCCAGGGCTGTGAGTTTTTG,AATTCAAAAACTCACAGCCCTGGGTTGATTTCTCGAGAAATCAACCCAGGGCTGTGAG,n/a
human,9379,NRXN2,XM_024448774.1,TRCN0000139335,NM_015080.2-5925s1c1,CCACTGCTCGTCCTGTTAATT,pLKO.1,2205,3UTR,100,100,15,10.5,N,9379,NRXN2,CCGGCCACTGCTCGTCCTGTTAATTCTCGAGAATTAACAGGACGAGCAGTGGTTTTTG,AATTCAAAAACCACTGCTCGTCCTGTTAATTCTCGAGAATTAACAGGACGAGCAGTGG,n/a
human,9379,NRXN2,XM_024448774.1,TRCN0000143238,NM_015080.2-5548s1c1,GAAGAACAAAGACAAGGAGTA,pLKO.1,1828,CDS,100,100,4.05,2.43,N,9379,NRXN2,CCGGGAAGAACAAAGACAAGGAGTACTCGAGTACTCCTTGTCTTTGTTCTTCTTTTTG,AATTCAAAAAGAAGAACAAAGACAAGGAGTACTCGAGTACTCCTTGTCTTTGTTCTTC,n/a
human,9379,NRXN2,XM_024448774.1,TRCN0000194255,NM_147045.1-756s1c2,CTTCATCCTCATCCTCTTCTT,pLKO.1,1663,CDS,85,89,,,Y,259047,Olfr683,CCGGCTTCATCCTCATCCTCTTCTTCTCGAGAAGAAGAGGATGAGGATGAAGTTTTTG,AATTCAAAAACTTCATCCTCATCCTCTTCTTCTCGAGAAGAAGAGGATGAGGATGAAG,n/a
human,9379,NRXN2,XM_024448774.1,TRCN0000098494,NM_027157.1-401s1c1,CTGTTGCTGCTACTGCTGCTA,pLKO.1,62,5UTR,85,89,,,Y,69664,Krtap1-5,CCGGCTGTTGCTGCTACTGCTGCTACTCGAGTAGCAGCAGTAGCAGCAACAGTTTTTG,AATTCAAAAACTGTTGCTGCTACTGCTGCTACTCGAGTAGCAGCAGTAGCAGCAACAG,n/a
human,9379,NRXN2,XM_024448774.1,TRCN0000059391,NM_003768.2-507s1c1,CCAAGAAGTACAAAGACATTA,pLKO.1,1824,CDS,80,89,,,Y,8682,PEA15,CCGGCCAAGAAGTACAAAGACATTACTCGAGTAATGTCTTTGTACTTCTTGGTTTTTG,AATTCAAAAACCAAGAAGTACAAAGACATTACTCGAGTAATGTCTTTGTACTTCTTGG,n/a
human,9379,NRXN2,XM_024448774.1,TRCN0000286681,NM_003768.3-504s21c1,CCAAGAAGTACAAAGACATTA,pLKO_005,1824,CDS,80,89,,,Y,8682,PEA15,CCGGCCAAGAAGTACAAAGACATTACTCGAGTAATGTCTTTGTACTTCTTGGTTTTTG,AATTCAAAAACCAAGAAGTACAAAGACATTACTCGAGTAATGTCTTTGTACTTCTTGG,n/a
human,9379,NRXN2,XM_024448774.1,TRCN0000230015,NM_006554.3-398s21c1,TAGGGCAAATGCAGAATATAT,pLKO_005,2621,3UTR,86,85,,,Y,10651,MTX2,CCGGTAGGGCAAATGCAGAATATATCTCGAGATATATTCTGCATTTGCCCTATTTTTG,AATTCAAAAATAGGGCAAATGCAGAATATATCTCGAGATATATTCTGCATTTGCCCTA,n/a
human,9379,NRXN2,XM_024448774.1,TRCN0000150054,NM_003136.2-1903s1c1,CCTTCTTTCCTCCCTTTAATA,pLKO.1,2367,3UTR,77,85,,,Y,6729,SRP54,CCGGCCTTCTTTCCTCCCTTTAATACTCGAGTATTAAAGGGAGGAAAGAAGGTTTTTG,AATTCAAAAACCTTCTTTCCTCCCTTTAATACTCGAGTATTAAAGGGAGGAAAGAAGG,n/a
human,9379,NRXN2,XM_024448774.1,TRCN0000278369,NM_003136.2-1903s21c1,CCTTCTTTCCTCCCTTTAATA,pLKO_005,2367,3UTR,77,85,,,Y,6729,SRP54,CCGGCCTTCTTTCCTCCCTTTAATACTCGAGTATTAAAGGGAGGAAAGAAGGTTTTTG,AATTCAAAAACCTTCTTTCCTCCCTTTAATACTCGAGTATTAAAGGGAGGAAAGAAGG,n/a
