Taxon,"Gene ID","Gene Symbol",Transcript,"Clone ID","Legacy Clone Name","Target Seq",Vector,"Match Position","Match Region","Match %","SDR Match %","Intrinsic Score","Adjusted Score","Matches Other Gene in Same Taxon?","Orig. Target Gene ID","Orig. Target Gene Symbol","Forward Oligo Sequence","Reverse Oligo Sequence",Addgene
human,196951,FAM227B,XM_024449865.1,TRCN0000135434,NM_152647.1-1073s1c1,GCAACGTTCCATGAAGCATTT,pLKO.1,944,CDS,100,100,10.8,15.12,N,196951,FAM227B,CCGGGCAACGTTCCATGAAGCATTTCTCGAGAAATGCTTCATGGAACGTTGCTTTTTG,AATTCAAAAAGCAACGTTCCATGAAGCATTTCTCGAGAAATGCTTCATGGAACGTTGC,n/a
human,196951,FAM227B,XM_024449865.1,TRCN0000135316,NM_152647.1-356s1c1,CCTCCAAAGAGCATTGAAGAA,pLKO.1,368,CDS,100,100,4.95,3.465,N,196951,FAM227B,CCGGCCTCCAAAGAGCATTGAAGAACTCGAGTTCTTCAATGCTCTTTGGAGGTTTTTG,AATTCAAAAACCTCCAAAGAGCATTGAAGAACTCGAGTTCTTCAATGCTCTTTGGAGG,n/a
human,196951,FAM227B,XM_024449865.1,TRCN0000296862,NM_015361.2-1114s21c1,AGACTTTCAGAAACGTTATAT,pLKO_005,842,CDS,85,89,,,Y,23518,R3HDM1,CCGGAGACTTTCAGAAACGTTATATCTCGAGATATAACGTTTCTGAAAGTCTTTTTTG,AATTCAAAAAAGACTTTCAGAAACGTTATATCTCGAGATATAACGTTTCTGAAAGTCT,n/a
human,196951,FAM227B,XM_024449865.1,TRCN0000002263,NM_014496.x-2507s1c1,GCAGTAGTGTTCAAGTGTTTA,pLKO.1,1580,3UTR,80,89,,,Y,27330,RPS6KA6,CCGGGCAGTAGTGTTCAAGTGTTTACTCGAGTAAACACTTGAACACTACTGCTTTTTG,AATTCAAAAAGCAGTAGTGTTCAAGTGTTTACTCGAGTAAACACTTGAACACTACTGC,n/a
human,196951,FAM227B,XM_024449865.1,TRCN0000071665,NM_008057.2-1152s1c1,CCTCTTCATGGTGCTTTACTT,pLKO.1,1305,3UTR,80,89,,,Y,14369,Fzd7,CCGGCCTCTTCATGGTGCTTTACTTCTCGAGAAGTAAAGCACCATGAAGAGGTTTTTG,AATTCAAAAACCTCTTCATGGTGCTTTACTTCTCGAGAAGTAAAGCACCATGAAGAGG,n/a
human,196951,FAM227B,XM_024449865.1,TRCN0000101990,NM_001029937.1-1362s1c1,CTTCTCTCCTTTAATTCCTAA,pLKO.1,1547,3UTR,80,89,,,Y,380683,Sec14l3,CCGGCTTCTCTCCTTTAATTCCTAACTCGAGTTAGGAATTAAAGGAGAGAAGTTTTTG,AATTCAAAAACTTCTCTCCTTTAATTCCTAACTCGAGTTAGGAATTAAAGGAGAGAAG,n/a
human,196951,FAM227B,XM_024449865.1,TRCN0000174504,NM_016871.1-1168s1c1,CTCAGAAAGGAAAGACTTGAT,pLKO.1,1129,CDS,77,85,,,Y,53333,Tomm40,CCGGCTCAGAAAGGAAAGACTTGATCTCGAGATCAAGTCTTTCCTTTCTGAGTTTTTG,AATTCAAAAACTCAGAAAGGAAAGACTTGATCTCGAGATCAAGTCTTTCCTTTCTGAG,n/a
human,196951,FAM227B,XM_024449865.1,TRCN0000279346,NM_016871.2-1392s21c1,CTCAGAAAGGAAAGACTTGAT,pLKO_005,1129,CDS,77,85,,,Y,53333,Tomm40,CCGGCTCAGAAAGGAAAGACTTGATCTCGAGATCAAGTCTTTCCTTTCTGAGTTTTTG,AATTCAAAAACTCAGAAAGGAAAGACTTGATCTCGAGATCAAGTCTTTCCTTTCTGAG,n/a
human,196951,FAM227B,XM_024449865.1,TRCN0000116412,NM_015848.1-2258s1c1,CTCCCATTCTTACTGGGAGTT,pLKO.1,163,5UTR,77,85,,,Y,51350,KRT76,CCGGCTCCCATTCTTACTGGGAGTTCTCGAGAACTCCCAGTAAGAATGGGAGTTTTTG,AATTCAAAAACTCCCATTCTTACTGGGAGTTCTCGAGAACTCCCAGTAAGAATGGGAG,n/a
