Taxon,"Gene ID","Gene Symbol",Transcript,"Clone ID","Legacy Clone Name","Target Seq",Vector,"Match Position","Match Region","Match %","SDR Match %","Intrinsic Score","Adjusted Score","Matches Other Gene in Same Taxon?","Orig. Target Gene ID","Orig. Target Gene Symbol","Forward Oligo Sequence","Reverse Oligo Sequence",Addgene
human,105377308,LOC105377308,XR_001741754.1,TRCN0000165534,NM_001012717.1-362s1c1,GAGACAGGGTTTCACCATGTT,pLKO.1,2441,3UTR,100,100,4.95,2.475,Y,,,CCGGGAGACAGGGTTTCACCATGTTCTCGAGAACATGGTGAAACCCTGTCTCTTTTTG,AATTCAAAAAGAGACAGGGTTTCACCATGTTCTCGAGAACATGGTGAAACCCTGTCTC,n/a
human,105377308,LOC105377308,XR_001741754.1,TRCN0000155836,NM_198582.1-3275s1c1,CCCAAAGTGCTGGGATTACAA,pLKO.1,2514,3UTR,95,100,5.625,2.8125,Y,377007,KLHL30,CCGGCCCAAAGTGCTGGGATTACAACTCGAGTTGTAATCCCAGCACTTTGGGTTTTTG,AATTCAAAAACCCAAAGTGCTGGGATTACAACTCGAGTTGTAATCCCAGCACTTTGGG,n/a
human,105377308,LOC105377308,XR_001741754.1,TRCN0000141025,NM_152361.1-835s1c1,CCCAAAGTGCTGGGATTACTT,pLKO.1,2514,3UTR,90,100,5.625,2.8125,Y,126272,EID2B,CCGGCCCAAAGTGCTGGGATTACTTCTCGAGAAGTAATCCCAGCACTTTGGGTTTTTG,AATTCAAAAACCCAAAGTGCTGGGATTACTTCTCGAGAAGTAATCCCAGCACTTTGGG,n/a
human,105377308,LOC105377308,XR_001741754.1,TRCN0000264189,NM_001085490.1-613s21c1,CAAGTAGCTGGGACTACAGGA,pLKO_005,2381,3UTR,90,100,2.64,1.32,Y,285501,LINC01098,CCGGCAAGTAGCTGGGACTACAGGACTCGAGTCCTGTAGTCCCAGCTACTTGTTTTTG,AATTCAAAAACAAGTAGCTGGGACTACAGGACTCGAGTCCTGTAGTCCCAGCTACTTG,n/a
human,105377308,LOC105377308,XR_001741754.1,TRCN0000204533,NM_001013675.1-1987s1c1,CCTCCCAAAGTGCTGGAATTA,pLKO.1,2511,3UTR,95,95,,,Y,400891,LRRC74B,CCGGCCTCCCAAAGTGCTGGAATTACTCGAGTAATTCCAGCACTTTGGGAGGTTTTTG,AATTCAAAAACCTCCCAAAGTGCTGGAATTACTCGAGTAATTCCAGCACTTTGGGAGG,n/a
human,105377308,LOC105377308,XR_001741754.1,TRCN0000072628,NM_016065.3-1636s1c1,CCTCCCAAAGTGCTAGGATTA,pLKO.1,2511,3UTR,95,95,,,Y,51021,MRPS16,CCGGCCTCCCAAAGTGCTAGGATTACTCGAGTAATCCTAGCACTTTGGGAGGTTTTTG,AATTCAAAAACCTCCCAAAGTGCTAGGATTACTCGAGTAATCCTAGCACTTTGGGAGG,n/a
human,105377308,LOC105377308,XR_001741754.1,TRCN0000162985,NM_207497.1-342s1c1,GAGACAAGGTTTCACCATGTT,pLKO.1,2441,3UTR,95,95,,,Y,401253,LINC00336,CCGGGAGACAAGGTTTCACCATGTTCTCGAGAACATGGTGAAACCTTGTCTCTTTTTG,AATTCAAAAAGAGACAAGGTTTCACCATGTTCTCGAGAACATGGTGAAACCTTGTCTC,n/a
human,105377308,LOC105377308,XR_001741754.1,TRCN0000073773,NM_022164.1-1914s1c1,CCTCTCAAGTAGCTGGGACTA,pLKO.1,2376,3UTR,95,95,,,Y,64129,TINAGL1,CCGGCCTCTCAAGTAGCTGGGACTACTCGAGTAGTCCCAGCTACTTGAGAGGTTTTTG,AATTCAAAAACCTCTCAAGTAGCTGGGACTACTCGAGTAGTCCCAGCTACTTGAGAGG,n/a
human,105377308,LOC105377308,XR_001741754.1,TRCN0000164801,NM_016534.2-1646s1c1,CCTCCCAAAGTACTGGGATTA,pLKO.1,2511,3UTR,95,95,,,Y,51275,MAPKAPK5-AS1,CCGGCCTCCCAAAGTACTGGGATTACTCGAGTAATCCCAGTACTTTGGGAGGTTTTTG,AATTCAAAAACCTCCCAAAGTACTGGGATTACTCGAGTAATCCCAGTACTTTGGGAGG,n/a
human,105377308,LOC105377308,XR_001741754.1,TRCN0000008902,NM_016540.2-2291s1c1,CCTCCCAAAGTGTTGGGATTA,pLKO.1,2511,3UTR,95,95,,,Y,10888,GPR83,CCGGCCTCCCAAAGTGTTGGGATTACTCGAGTAATCCCAACACTTTGGGAGGTTTTTG,AATTCAAAAACCTCCCAAAGTGTTGGGATTACTCGAGTAATCCCAACACTTTGGGAGG,n/a
human,105377308,LOC105377308,XR_001741754.1,TRCN0000156315,NM_020702.1-3633s1c1,CCTCCCAAAGTGTTGGGATTA,pLKO.1,2511,3UTR,95,95,,,Y,57462,MYORG,CCGGCCTCCCAAAGTGTTGGGATTACTCGAGTAATCCCAACACTTTGGGAGGTTTTTG,AATTCAAAAACCTCCCAAAGTGTTGGGATTACTCGAGTAATCCCAACACTTTGGGAGG,n/a
human,105377308,LOC105377308,XR_001741754.1,TRCN0000116227,NM_024930.1-2895s1c1,CCTCCCAAAGTTCTGGGATTA,pLKO.1,2511,3UTR,95,95,,,Y,79993,ELOVL7,CCGGCCTCCCAAAGTTCTGGGATTACTCGAGTAATCCCAGAACTTTGGGAGGTTTTTG,AATTCAAAAACCTCCCAAAGTTCTGGGATTACTCGAGTAATCCCAGAACTTTGGGAGG,n/a
human,105377308,LOC105377308,XR_001741754.1,TRCN0000164591,NM_003281.3-2102s1c1,CCTCCCAAAGTTCTGGGATTA,pLKO.1,2511,3UTR,95,95,,,Y,7135,TNNI1,CCGGCCTCCCAAAGTTCTGGGATTACTCGAGTAATCCCAGAACTTTGGGAGGTTTTTG,AATTCAAAAACCTCCCAAAGTTCTGGGATTACTCGAGTAATCCCAGAACTTTGGGAGG,n/a
human,105377308,LOC105377308,XR_001741754.1,TRCN0000040213,NM_000618.2-6169s1c1,CCTCCCAAATTGCTGGGATTA,pLKO.1,2511,3UTR,95,95,,,Y,3479,IGF1,CCGGCCTCCCAAATTGCTGGGATTACTCGAGTAATCCCAGCAATTTGGGAGGTTTTTG,AATTCAAAAACCTCCCAAATTGCTGGGATTACTCGAGTAATCCCAGCAATTTGGGAGG,n/a
human,105377308,LOC105377308,XR_001741754.1,TRCN0000008424,NM_023913.2-3361s1c1,CCCACTTCTCTTTCTTTCTAA,pLKO.1,2659,3UTR,90,95,,,Y,78943,Ern1,CCGGCCCACTTCTCTTTCTTTCTAACTCGAGTTAGAAAGAAAGAGAAGTGGGTTTTTG,AATTCAAAAACCCACTTCTCTTTCTTTCTAACTCGAGTTAGAAAGAAAGAGAAGTGGG,n/a
human,105377308,LOC105377308,XR_001741754.1,TRCN0000162795,NM_017842.1-1079s1c1,CTTCCAAAGTGCTGGGATTAT,pLKO.1,2512,3UTR,90,95,,,Y,55652,SLC48A1,CCGGCTTCCAAAGTGCTGGGATTATCTCGAGATAATCCCAGCACTTTGGAAGTTTTTG,AATTCAAAAACTTCCAAAGTGCTGGGATTATCTCGAGATAATCCCAGCACTTTGGAAG,n/a
human,105377308,LOC105377308,XR_001741754.1,TRCN0000337418,NM_001114403.1-1038s21c1,CCTCACGGGTTCAAGCGATTT,pLKO_005,2344,3UTR,90,95,,,Y,100134938,UPK3BL1,CCGGCCTCACGGGTTCAAGCGATTTCTCGAGAAATCGCTTGAACCCGTGAGGTTTTTG,AATTCAAAAACCTCACGGGTTCAAGCGATTTCTCGAGAAATCGCTTGAACCCGTGAGG,n/a
human,105377308,LOC105377308,XR_001741754.1,TRCN0000140657,NM_012099.1-2957s1c1,CCTCCCAAAGTGCTAGGATAA,pLKO.1,2511,3UTR,90,95,,,Y,10849,CD3EAP,CCGGCCTCCCAAAGTGCTAGGATAACTCGAGTTATCCTAGCACTTTGGGAGGTTTTTG,AATTCAAAAACCTCCCAAAGTGCTAGGATAACTCGAGTTATCCTAGCACTTTGGGAGG,n/a
human,105377308,LOC105377308,XR_001741754.1,TRCN0000165027,NM_001013636.1-513s1c1,GAACTCCTGACCTCAAGTGAT,pLKO.1,2477,3UTR,90,95,,,Y,387873,LOC387873,CCGGGAACTCCTGACCTCAAGTGATCTCGAGATCACTTGAGGTCAGGAGTTCTTTTTG,AATTCAAAAAGAACTCCTGACCTCAAGTGATCTCGAGATCACTTGAGGTCAGGAGTTC,n/a
human,105377308,LOC105377308,XR_001741754.1,TRCN0000157407,NM_001003795.1-3187s1c1,GATCTCGGCTTACTGCAACTT,pLKO.1,2320,3UTR,90,95,,,Y,389524,GTF2IRD2B,CCGGGATCTCGGCTTACTGCAACTTCTCGAGAAGTTGCAGTAAGCCGAGATCTTTTTG,AATTCAAAAAGATCTCGGCTTACTGCAACTTCTCGAGAAGTTGCAGTAAGCCGAGATC,n/a
human,105377308,LOC105377308,XR_001741754.1,TRCN0000047783,NM_017516.1-1624s1c1,GCCTCCAAAGTGCTGGAATTA,pLKO.1,2510,3UTR,90,90,,,Y,54734,RAB39A,CCGGGCCTCCAAAGTGCTGGAATTACTCGAGTAATTCCAGCACTTTGGAGGCTTTTTG,AATTCAAAAAGCCTCCAAAGTGCTGGAATTACTCGAGTAATTCCAGCACTTTGGAGGC,n/a
human,105377308,LOC105377308,XR_001741754.1,TRCN0000091448,NM_013513.1-2495s1c1,CCTCCCAAGTACTGGGATTAA,pLKO.1,2376,3UTR,86,90,,,Y,13828,Epb42,CCGGCCTCCCAAGTACTGGGATTAACTCGAGTTAATCCCAGTACTTGGGAGGTTTTTG,AATTCAAAAACCTCCCAAGTACTGGGATTAACTCGAGTTAATCCCAGTACTTGGGAGG,n/a
human,105377308,LOC105377308,XR_001741754.1,TRCN0000148148,NM_152654.1-1281s1c1,GAGACAGAGTTTCACCATATT,pLKO.1,2441,3UTR,90,89,,,Y,199699,DAND5,CCGGGAGACAGAGTTTCACCATATTCTCGAGAATATGGTGAAACTCTGTCTCTTTTTG,AATTCAAAAAGAGACAGAGTTTCACCATATTCTCGAGAATATGGTGAAACTCTGTCTC,n/a
human,105377308,LOC105377308,XR_001741754.1,TRCN0000140610,NM_025042.2-931s1c1,GCCTCTCAGGTTCAAGCAATT,pLKO.1,2343,3UTR,90,89,,,Y,,,CCGGGCCTCTCAGGTTCAAGCAATTCTCGAGAATTGCTTGAACCTGAGAGGCTTTTTG,AATTCAAAAAGCCTCTCAGGTTCAAGCAATTCTCGAGAATTGCTTGAACCTGAGAGGC,n/a
human,105377308,LOC105377308,XR_001741754.1,TRCN0000116737,NM_016369.3-2405s1c1,CCTCCCAAGTAGCTGGAATTA,pLKO.1,2376,3UTR,90,89,,,Y,51208,CLDN18,CCGGCCTCCCAAGTAGCTGGAATTACTCGAGTAATTCCAGCTACTTGGGAGGTTTTTG,AATTCAAAAACCTCCCAAGTAGCTGGAATTACTCGAGTAATTCCAGCTACTTGGGAGG,n/a
human,105377308,LOC105377308,XR_001741754.1,TRCN0000042823,NM_024055.2-973s1c1,CCTCACAAAGTGCTAGGATTA,pLKO.1,2511,3UTR,90,89,,,Y,64924,SLC30A5,CCGGCCTCACAAAGTGCTAGGATTACTCGAGTAATCCTAGCACTTTGTGAGGTTTTTG,AATTCAAAAACCTCACAAAGTGCTAGGATTACTCGAGTAATCCTAGCACTTTGTGAGG,n/a
human,105377308,LOC105377308,XR_001741754.1,TRCN0000082462,XM_371492.2-638s1c1,CCTCCCAAAGTGCCAGGATTA,pLKO.1,2511,3UTR,90,89,,,Y,388949,LOC388949,CCGGCCTCCCAAAGTGCCAGGATTACTCGAGTAATCCTGGCACTTTGGGAGGTTTTTG,AATTCAAAAACCTCCCAAAGTGCCAGGATTACTCGAGTAATCCTGGCACTTTGGGAGG,n/a
human,105377308,LOC105377308,XR_001741754.1,TRCN0000165736,NM_175901.3-1946s1c1,CCTCCCTAAGTGTTGGGATTA,pLKO.1,2511,3UTR,90,89,,,Y,283932,FBXL19-AS1,CCGGCCTCCCTAAGTGTTGGGATTACTCGAGTAATCCCAACACTTAGGGAGGTTTTTG,AATTCAAAAACCTCCCTAAGTGTTGGGATTACTCGAGTAATCCCAACACTTAGGGAGG,n/a
human,105377308,LOC105377308,XR_001741754.1,TRCN0000166560,NM_207497.1-412s1c1,CCTCCGAAAGTGCTAGGATTA,pLKO.1,2511,3UTR,90,89,,,Y,401253,LINC00336,CCGGCCTCCGAAAGTGCTAGGATTACTCGAGTAATCCTAGCACTTTCGGAGGTTTTTG,AATTCAAAAACCTCCGAAAGTGCTAGGATTACTCGAGTAATCCTAGCACTTTCGGAGG,n/a
human,105377308,LOC105377308,XR_001741754.1,TRCN0000164091,NM_024795.1-1273s1c1,CCTCCTAAAGTGCTGCGATTA,pLKO.1,2511,3UTR,90,89,,,Y,79853,TM4SF20,CCGGCCTCCTAAAGTGCTGCGATTACTCGAGTAATCGCAGCACTTTAGGAGGTTTTTG,AATTCAAAAACCTCCTAAAGTGCTGCGATTACTCGAGTAATCGCAGCACTTTAGGAGG,n/a
human,105377308,LOC105377308,XR_001741754.1,TRCN0000165774,NM_001012391.1-946s1c1,CCTCCTAAGTAGCTGGGATTA,pLKO.1,2376,3UTR,90,89,,,Y,100652781,SNX29P1,CCGGCCTCCTAAGTAGCTGGGATTACTCGAGTAATCCCAGCTACTTAGGAGGTTTTTG,AATTCAAAAACCTCCTAAGTAGCTGGGATTACTCGAGTAATCCCAGCTACTTAGGAGG,n/a
human,105377308,LOC105377308,XR_001741754.1,TRCN0000060503,NM_001001414.1-1521s1c1,CCTCTCAAGTAGCTGGGATTA,pLKO.1,2376,3UTR,90,89,,,Y,342897,NCCRP1,CCGGCCTCTCAAGTAGCTGGGATTACTCGAGTAATCCCAGCTACTTGAGAGGTTTTTG,AATTCAAAAACCTCTCAAGTAGCTGGGATTACTCGAGTAATCCCAGCTACTTGAGAGG,n/a
human,105377308,LOC105377308,XR_001741754.1,TRCN0000155576,NM_198582.1-3137s1c1,CCTCTCAAGTAGCTGGGATTA,pLKO.1,2376,3UTR,90,89,,,Y,377007,KLHL30,CCGGCCTCTCAAGTAGCTGGGATTACTCGAGTAATCCCAGCTACTTGAGAGGTTTTTG,AATTCAAAAACCTCTCAAGTAGCTGGGATTACTCGAGTAATCCCAGCTACTTGAGAGG,n/a
human,105377308,LOC105377308,XR_001741754.1,TRCN0000165697,NM_017842.1-943s1c1,CCTCTCAAGTAGCTGGGATTA,pLKO.1,2376,3UTR,90,89,,,Y,55652,SLC48A1,CCGGCCTCTCAAGTAGCTGGGATTACTCGAGTAATCCCAGCTACTTGAGAGGTTTTTG,AATTCAAAAACCTCTCAAGTAGCTGGGATTACTCGAGTAATCCCAGCTACTTGAGAGG,n/a
human,105377308,LOC105377308,XR_001741754.1,TRCN0000138395,XM_374933.1-1847s1c1,CCTTCCAAGTAGCTGGGATTA,pLKO.1,2376,3UTR,90,89,,,Y,399949,C11orf88,CCGGCCTTCCAAGTAGCTGGGATTACTCGAGTAATCCCAGCTACTTGGAAGGTTTTTG,AATTCAAAAACCTTCCAAGTAGCTGGGATTACTCGAGTAATCCCAGCTACTTGGAAGG,n/a
human,105377308,LOC105377308,XR_001741754.1,TRCN0000165436,NM_001012391.1-1011s1c1,GAGAAAGGGTTTCGCCATGTT,pLKO.1,2441,3UTR,90,89,,,Y,100652781,SNX29P1,CCGGGAGAAAGGGTTTCGCCATGTTCTCGAGAACATGGCGAAACCCTTTCTCTTTTTG,AATTCAAAAAGAGAAAGGGTTTCGCCATGTTCTCGAGAACATGGCGAAACCCTTTCTC,n/a
human,105377308,LOC105377308,XR_001741754.1,TRCN0000140238,NM_024895.3-1807s1c1,GTCTCCCAAAGTGCTAGGATT,pLKO.1,2510,3UTR,90,89,,,Y,79955,PDZD7,CCGGGTCTCCCAAAGTGCTAGGATTCTCGAGAATCCTAGCACTTTGGGAGACTTTTTG,AATTCAAAAAGTCTCCCAAAGTGCTAGGATTCTCGAGAATCCTAGCACTTTGGGAGAC,n/a
human,105377308,LOC105377308,XR_001741754.1,TRCN0000129445,NM_145048.2-1500s1c1,GACTTCCAAAGTGCTGGGATT,pLKO.1,2510,3UTR,90,89,,,Y,133015,PACRGL,CCGGGACTTCCAAAGTGCTGGGATTCTCGAGAATCCCAGCACTTTGGAAGTCTTTTTG,AATTCAAAAAGACTTCCAAAGTGCTGGGATTCTCGAGAATCCCAGCACTTTGGAAGTC,n/a
human,105377308,LOC105377308,XR_001741754.1,TRCN0000140759,NM_018265.1-3067s1c1,GCCTTTCAAAGTGCTGGGATT,pLKO.1,2510,3UTR,90,89,,,Y,55765,INAVA,CCGGGCCTTTCAAAGTGCTGGGATTCTCGAGAATCCCAGCACTTTGAAAGGCTTTTTG,AATTCAAAAAGCCTTTCAAAGTGCTGGGATTCTCGAGAATCCCAGCACTTTGAAAGGC,n/a
human,105377308,LOC105377308,XR_001741754.1,TRCN0000155070,NM_017873.2-2761s1c1,GCCTTTCAAAGTGCTGGGATT,pLKO.1,2510,3UTR,90,89,,,Y,140459,ASB6,CCGGGCCTTTCAAAGTGCTGGGATTCTCGAGAATCCCAGCACTTTGAAAGGCTTTTTG,AATTCAAAAAGCCTTTCAAAGTGCTGGGATTCTCGAGAATCCCAGCACTTTGAAAGGC,n/a
human,105377308,LOC105377308,XR_001741754.1,TRCN0000163829,NM_173639.1-1102s1c1,CCTCCCAAATTACTGGGATTA,pLKO.1,2511,3UTR,90,89,,,Y,284618,RUSC1-AS1,CCGGCCTCCCAAATTACTGGGATTACTCGAGTAATCCCAGTAATTTGGGAGGTTTTTG,AATTCAAAAACCTCCCAAATTACTGGGATTACTCGAGTAATCCCAGTAATTTGGGAGG,n/a
human,105377308,LOC105377308,XR_001741754.1,TRCN0000057398,NM_002261.1-793s1c1,CCTCCCAAGTTGCTGGGATTA,pLKO.1,2376,3UTR,90,89,,,Y,3823,KLRC3,CCGGCCTCCCAAGTTGCTGGGATTACTCGAGTAATCCCAGCAACTTGGGAGGTTTTTG,AATTCAAAAACCTCCCAAGTTGCTGGGATTACTCGAGTAATCCCAGCAACTTGGGAGG,n/a
human,105377308,LOC105377308,XR_001741754.1,TRCN0000140374,NM_025042.2-1098s1c1,GCTTCCCAAAGTACTGGGATT,pLKO.1,2510,3UTR,90,89,,,Y,,,CCGGGCTTCCCAAAGTACTGGGATTCTCGAGAATCCCAGTACTTTGGGAAGCTTTTTG,AATTCAAAAAGCTTCCCAAAGTACTGGGATTCTCGAGAATCCCAGTACTTTGGGAAGC,n/a
human,105377308,LOC105377308,XR_001741754.1,TRCN0000098117,NM_054042.2-1639s1c1,CCCATTATCTCAACCAACTAT,pLKO.1,2098,3UTR,85,89,,,N,70445,Cd248,CCGGCCCATTATCTCAACCAACTATCTCGAGATAGTTGGTTGAGATAATGGGTTTTTG,AATTCAAAAACCCATTATCTCAACCAACTATCTCGAGATAGTTGGTTGAGATAATGGG,n/a
human,105377308,LOC105377308,XR_001741754.1,TRCN0000172703,NM_007059.1-1329s1c1,GCTGAGAATGCAGCCTCTTAA,pLKO.1,2997,3UTR,85,89,,,Y,11133,KPTN,CCGGGCTGAGAATGCAGCCTCTTAACTCGAGTTAAGAGGCTGCATTCTCAGCTTTTTG,AATTCAAAAAGCTGAGAATGCAGCCTCTTAACTCGAGTTAAGAGGCTGCATTCTCAGC,n/a
human,105377308,LOC105377308,XR_001741754.1,TRCN0000145511,NM_182496.1-1687s1c1,GAGAGGATGAAACAGAAAGAA,pLKO.1,125,3UTR,85,89,,,Y,120935,CCDC38,CCGGGAGAGGATGAAACAGAAAGAACTCGAGTTCTTTCTGTTTCATCCTCTCTTTTTG,AATTCAAAAAGAGAGGATGAAACAGAAAGAACTCGAGTTCTTTCTGTTTCATCCTCTC,n/a
human,105377308,LOC105377308,XR_001741754.1,TRCN0000172710,NM_032937.2-575s1c1,GAACTCCTGACCTCAAGCAAT,pLKO.1,2477,3UTR,85,89,,,Y,85026,ARRDC1-AS1,CCGGGAACTCCTGACCTCAAGCAATCTCGAGATTGCTTGAGGTCAGGAGTTCTTTTTG,AATTCAAAAAGAACTCCTGACCTCAAGCAATCTCGAGATTGCTTGAGGTCAGGAGTTC,n/a
human,105377308,LOC105377308,XR_001741754.1,TRCN0000141125,NM_153233.1-1432s1c1,CAGGTTCAAGAGATTCTCCTA,pLKO.1,2349,3UTR,85,89,,,Y,163183,SYNE4,CCGGCAGGTTCAAGAGATTCTCCTACTCGAGTAGGAGAATCTCTTGAACCTGTTTTTG,AATTCAAAAACAGGTTCAAGAGATTCTCCTACTCGAGTAGGAGAATCTCTTGAACCTG,n/a
human,105377308,LOC105377308,XR_001741754.1,TRCN0000130146,NM_207443.1-652s1c1,CAGGTTCAAGTGATTCTCCTA,pLKO.1,2349,3UTR,85,89,,,Y,400242,DICER1-AS1,CCGGCAGGTTCAAGTGATTCTCCTACTCGAGTAGGAGAATCACTTGAACCTGTTTTTG,AATTCAAAAACAGGTTCAAGTGATTCTCCTACTCGAGTAGGAGAATCACTTGAACCTG,n/a
human,105377308,LOC105377308,XR_001741754.1,TRCN0000087472,XM_486030.1-248s1c1,CCCACACTCTCTTGAGAGCAT,pLKO.1,2110,3UTR,85,89,,,Y,434259,LOC434259,CCGGCCCACACTCTCTTGAGAGCATCTCGAGATGCTCTCAAGAGAGTGTGGGTTTTTG,AATTCAAAAACCCACACTCTCTTGAGAGCATCTCGAGATGCTCTCAAGAGAGTGTGGG,n/a
human,105377308,LOC105377308,XR_001741754.1,TRCN0000026875,XM_156269.3-256s1c1,GCATTGAAAGAATGCAACATA,pLKO.1,120,3UTR,85,89,,,Y,100043449,Gm4444,CCGGGCATTGAAAGAATGCAACATACTCGAGTATGTTGCATTCTTTCAATGCTTTTTG,AATTCAAAAAGCATTGAAAGAATGCAACATACTCGAGTATGTTGCATTCTTTCAATGC,n/a
human,105377308,LOC105377308,XR_001741754.1,TRCN0000232579,NM_012346.3-2046s21c1,GCTTTCATTTGAGTATCTTTG,pLKO_005,3551,3UTR,80,89,,,Y,23636,NUP62,CCGGGCTTTCATTTGAGTATCTTTGCTCGAGCAAAGATACTCAAATGAAAGCTTTTTG,AATTCAAAAAGCTTTCATTTGAGTATCTTTGCTCGAGCAAAGATACTCAAATGAAAGC,n/a
human,105377308,LOC105377308,XR_001741754.1,TRCN0000197046,NM_017431.2-1954s1c1,GCTGCTGAAATGCTGCATTTC,pLKO.1,106,3UTR,80,89,,,Y,53632,PRKAG3,CCGGGCTGCTGAAATGCTGCATTTCCTCGAGGAAATGCAGCATTTCAGCAGCTTTTTG,AATTCAAAAAGCTGCTGAAATGCTGCATTTCCTCGAGGAAATGCAGCATTTCAGCAGC,n/a
human,105377308,LOC105377308,XR_001741754.1,TRCN0000168807,NM_178520.2-2253s1c1,GCTGATCTCAAACTCCTGATA,pLKO.1,2468,3UTR,80,89,,,Y,284186,TMEM105,CCGGGCTGATCTCAAACTCCTGATACTCGAGTATCAGGAGTTTGAGATCAGCTTTTTG,AATTCAAAAAGCTGATCTCAAACTCCTGATACTCGAGTATCAGGAGTTTGAGATCAGC,n/a
human,105377308,LOC105377308,XR_001741754.1,TRCN0000022815,NM_011100.3-1160s1c1,GCTATTTATCAGAGAAAGGTT,pLKO.1,1797,3UTR,80,89,,,Y,18749,Prkacb,CCGGGCTATTTATCAGAGAAAGGTTCTCGAGAACCTTTCTCTGATAAATAGCTTTTTG,AATTCAAAAAGCTATTTATCAGAGAAAGGTTCTCGAGAACCTTTCTCTGATAAATAGC,n/a
human,105377308,LOC105377308,XR_001741754.1,TRCN0000005629,NM_003979.2-1289s1c1,CCTTACAAAGACTATGAAGTA,pLKO.1,3875,3UTR,86,86,,,Y,9052,GPRC5A,CCGGCCTTACAAAGACTATGAAGTACTCGAGTACTTCATAGTCTTTGTAAGGTTTTTG,AATTCAAAAACCTTACAAAGACTATGAAGTACTCGAGTACTTCATAGTCTTTGTAAGG,n/a
human,105377308,LOC105377308,XR_001741754.1,TRCN0000230423,NM_001031617.2-203s21c1,TGAAGTGTCTTCATAACAATA,pLKO_005,3387,3UTR,86,85,,,Y,90639,COX19,CCGGTGAAGTGTCTTCATAACAATACTCGAGTATTGTTATGAAGACACTTCATTTTTG,AATTCAAAAATGAAGTGTCTTCATAACAATACTCGAGTATTGTTATGAAGACACTTCA,n/a
human,105377308,LOC105377308,XR_001741754.1,TRCN0000431642,NM_029943.1-180s21c1,ACGAGCTGGATGCTGATATTG,pLKO_005,1675,3UTR,81,85,,,Y,77622,Apex2,CCGGACGAGCTGGATGCTGATATTGCTCGAGCAATATCAGCATCCAGCTCGTTTTTTG,AATTCAAAAAACGAGCTGGATGCTGATATTGCTCGAGCAATATCAGCATCCAGCTCGT,n/a
human,105377308,LOC105377308,XR_001741754.1,TRCN0000033437,NM_003616.1-872s1c1,CTGCTTGGTTAGCAGGTATTT,pLKO.1,1642,3UTR,81,85,,,Y,8487,GEMIN2,CCGGCTGCTTGGTTAGCAGGTATTTCTCGAGAAATACCTGCTAACCAAGCAGTTTTTG,AATTCAAAAACTGCTTGGTTAGCAGGTATTTCTCGAGAAATACCTGCTAACCAAGCAG,n/a
human,105377308,LOC105377308,XR_001741754.1,TRCN0000299584,NM_003616.2-811s21c1,CTGCTTGGTTAGCAGGTATTT,pLKO_005,1642,3UTR,81,85,,,Y,8487,GEMIN2,CCGGCTGCTTGGTTAGCAGGTATTTCTCGAGAAATACCTGCTAACCAAGCAGTTTTTG,AATTCAAAAACTGCTTGGTTAGCAGGTATTTCTCGAGAAATACCTGCTAACCAAGCAG,n/a
human,105377308,LOC105377308,XR_001741754.1,TRCN0000093168,NM_009308.3-1483s1c1,CCAGGAGACAAATTGCTAAGT,pLKO.1,1372,3UTR,77,85,,,Y,20983,Syt4,CCGGCCAGGAGACAAATTGCTAAGTCTCGAGACTTAGCAATTTGTCTCCTGGTTTTTG,AATTCAAAAACCAGGAGACAAATTGCTAAGTCTCGAGACTTAGCAATTTGTCTCCTGG,n/a
