Taxon,"Gene ID","Gene Symbol",Transcript,"Clone ID","Legacy Clone Name","Target Seq",Vector,"Match Position","Match Region","Match %","SDR Match %","Intrinsic Score","Adjusted Score","Matches Other Gene in Same Taxon?","Orig. Target Gene ID","Orig. Target Gene Symbol","Forward Oligo Sequence","Reverse Oligo Sequence",Addgene
human,1212,CLTB,XR_001741996.2,TRCN0000310296,NM_001834.2-270s21c1,AGAGCGAGATTGCAGGCATAG,pLKO_005,271,3UTR,100,100,6,3.6,N,1212,CLTB,CCGGAGAGCGAGATTGCAGGCATAGCTCGAGCTATGCCTGCAATCTCGCTCTTTTTTG,AATTCAAAAAAGAGCGAGATTGCAGGCATAGCTCGAGCTATGCCTGCAATCTCGCTCT,n/a
human,1212,CLTB,XR_001741996.2,TRCN0000308263,NM_001834.2-385s21c1,CACAGTCAATGGAGATGTGTT,pLKO_005,386,3UTR,100,100,4.95,2.97,N,1212,CLTB,CCGGCACAGTCAATGGAGATGTGTTCTCGAGAACACATCTCCATTGACTGTGTTTTTG,AATTCAAAAACACAGTCAATGGAGATGTGTTCTCGAGAACACATCTCCATTGACTGTG,n/a
human,1212,CLTB,XR_001741996.2,TRCN0000348724,NM_028870.3-109s21c1,AGATTGCTGGCATCGAGAATG,pLKO_005,277,3UTR,85,89,,,Y,74325,Cltb,CCGGAGATTGCTGGCATCGAGAATGCTCGAGCATTCTCGATGCCAGCAATCTTTTTTG,AATTCAAAAAAGATTGCTGGCATCGAGAATGCTCGAGCATTCTCGATGCCAGCAATCT,n/a
human,1212,CLTB,XR_001741996.2,TRCN0000086118,NM_008297.2-1884s1c1,CCCAGCTAAACTTGTTTATTT,pLKO.1,1099,3UTR,85,89,,,Y,15500,Hsf2,CCGGCCCAGCTAAACTTGTTTATTTCTCGAGAAATAAACAAGTTTAGCTGGGTTTTTG,AATTCAAAAACCCAGCTAAACTTGTTTATTTCTCGAGAAATAAACAAGTTTAGCTGGG,n/a
human,1212,CLTB,XR_001741996.2,TRCN0000226086,NM_001033327.2-8063s21c1,GCAGTAAATGAACGGATATTA,pLKO_005,1190,3UTR,80,89,,,N,236798,Adgrg4,CCGGGCAGTAAATGAACGGATATTACTCGAGTAATATCCGTTCATTTACTGCTTTTTG,AATTCAAAAAGCAGTAAATGAACGGATATTACTCGAGTAATATCCGTTCATTTACTGC,n/a
human,1212,CLTB,XR_001741996.2,TRCN0000188758,NM_146751.1-201s1c1,GCTGGCAATGACTGATCTCAT,pLKO.1,927,3UTR,80,89,,,Y,258746,Olfr648,CCGGGCTGGCAATGACTGATCTCATCTCGAGATGAGATCAGTCATTGCCAGCTTTTTG,AATTCAAAAAGCTGGCAATGACTGATCTCATCTCGAGATGAGATCAGTCATTGCCAGC,n/a
human,1212,CLTB,XR_001741996.2,TRCN0000137013,NM_018134.1-1858s1c1,CAGGAGATGGAGATTGCAGTA,pLKO.1,267,3UTR,80,89,,,Y,55721,IQCC,CCGGCAGGAGATGGAGATTGCAGTACTCGAGTACTGCAATCTCCATCTCCTGTTTTTG,AATTCAAAAACAGGAGATGGAGATTGCAGTACTCGAGTACTGCAATCTCCATCTCCTG,n/a
human,1212,CLTB,XR_001741996.2,TRCN0000192423,NM_001025241.1-373s1c1,CAGAATTTCTCATGGGTGGAA,pLKO.1,728,3UTR,80,89,,,Y,434960,Gm20747,CCGGCAGAATTTCTCATGGGTGGAACTCGAGTTCCACCCATGAGAAATTCTGTTTTTG,AATTCAAAAACAGAATTTCTCATGGGTGGAACTCGAGTTCCACCCATGAGAAATTCTG,n/a
human,1212,CLTB,XR_001741996.2,TRCN0000293524,NM_018101.2-722s21c1,AGCAGCAGGAGAGCGGATTTA,pLKO_005,262,3UTR,77,85,,,Y,55143,CDCA8,CCGGAGCAGCAGGAGAGCGGATTTACTCGAGTAAATCCGCTCTCCTGCTGCTTTTTTG,AATTCAAAAAAGCAGCAGGAGAGCGGATTTACTCGAGTAAATCCGCTCTCCTGCTGCT,n/a
