Taxon,"Gene ID","Gene Symbol",Transcript,"Clone ID","Legacy Clone Name","Target Seq",Vector,"Match Position","Match Region","Match %","SDR Match %","Intrinsic Score","Adjusted Score","Matches Other Gene in Same Taxon?","Orig. Target Gene ID","Orig. Target Gene Symbol","Forward Oligo Sequence","Reverse Oligo Sequence",Addgene
human,9542,NRG2,XR_001742351.1,TRCN0000058863,NM_004883.1-1064s1c1,GCCGAGACATTCGCATCAAAT,pLKO.1,1203,3UTR,100,100,13.2,18.48,N,9542,NRG2,CCGGGCCGAGACATTCGCATCAAATCTCGAGATTTGATGCGAATGTCTCGGCTTTTTG,AATTCAAAAAGCCGAGACATTCGCATCAAATCTCGAGATTTGATGCGAATGTCTCGGC,n/a
human,9542,NRG2,XR_001742351.1,TRCN0000438742,NM_004883.1-2067s21c1,GGTGCCAACTTTCGAGATCAC,pLKO_005,2129,3UTR,100,100,4.05,5.67,N,9542,NRG2,CCGGGGTGCCAACTTTCGAGATCACCTCGAGGTGATCTCGAAAGTTGGCACCTTTTTG,AATTCAAAAAGGTGCCAACTTTCGAGATCACCTCGAGGTGATCTCGAAAGTTGGCACC,n/a
human,9542,NRG2,XR_001742351.1,TRCN0000434416,NM_004883.1-1095s21c1,CAGAAAGAACTCACGACTACA,pLKO_005,1234,3UTR,100,100,4.95,3.96,N,9542,NRG2,CCGGCAGAAAGAACTCACGACTACACTCGAGTGTAGTCGTGAGTTCTTTCTGTTTTTG,AATTCAAAAACAGAAAGAACTCACGACTACACTCGAGTGTAGTCGTGAGTTCTTTCTG,n/a
human,9542,NRG2,XR_001742351.1,TRCN0000455012,NM_004883.1-788s21c1,TCGAAAGGAACCAGCGCTACA,pLKO_005,927,3UTR,100,100,4.05,3.24,N,9542,NRG2,CCGGTCGAAAGGAACCAGCGCTACACTCGAGTGTAGCGCTGGTTCCTTTCGATTTTTG,AATTCAAAAATCGAAAGGAACCAGCGCTACACTCGAGTGTAGCGCTGGTTCCTTTCGA,n/a
human,9542,NRG2,XR_001742351.1,TRCN0000433268,NM_004883.1-839s21c1,TAGTCTTTAAGACGGCCTTTG,pLKO_005,978,3UTR,100,100,6,4.2,N,9542,NRG2,CCGGTAGTCTTTAAGACGGCCTTTGCTCGAGCAAAGGCCGTCTTAAAGACTATTTTTG,AATTCAAAAATAGTCTTTAAGACGGCCTTTGCTCGAGCAAAGGCCGTCTTAAAGACTA,n/a
human,9542,NRG2,XR_001742351.1,TRCN0000446019,NM_004883.1-972s21c1,GGGTGAGAAGCAATCGCTGAA,pLKO_005,1111,3UTR,100,100,4.05,2.835,N,9542,NRG2,CCGGGGGTGAGAAGCAATCGCTGAACTCGAGTTCAGCGATTGCTTCTCACCCTTTTTG,AATTCAAAAAGGGTGAGAAGCAATCGCTGAACTCGAGTTCAGCGATTGCTTCTCACCC,n/a
human,9542,NRG2,XR_001742351.1,TRCN0000058867,NM_004883.1-1270s1c1,GCCAAGTCCTATTGCGTCAAT,pLKO.1,1409,3UTR,100,100,4.95,2.97,N,9542,NRG2,CCGGGCCAAGTCCTATTGCGTCAATCTCGAGATTGACGCAATAGGACTTGGCTTTTTG,AATTCAAAAAGCCAAGTCCTATTGCGTCAATCTCGAGATTGACGCAATAGGACTTGGC,n/a
human,9542,NRG2,XR_001742351.1,TRCN0000058865,NM_004883.1-933s1c1,GCCCAAGTTGAAGAAGATGAA,pLKO.1,1072,3UTR,100,100,4.95,2.97,N,9542,NRG2,CCGGGCCCAAGTTGAAGAAGATGAACTCGAGTTCATCTTCTTCAACTTGGGCTTTTTG,AATTCAAAAAGCCCAAGTTGAAGAAGATGAACTCGAGTTCATCTTCTTCAACTTGGGC,n/a
human,9542,NRG2,XR_001742351.1,TRCN0000065362,XM_355073.2-726s1c1,CGGCTTCTCGATGCTGCTCTT,pLKO.1,661,3UTR,95,95,,,N,100042150,Nrg2,CCGGCGGCTTCTCGATGCTGCTCTTCTCGAGAAGAGCAGCATCGAGAAGCCGTTTTTG,AATTCAAAAACGGCTTCTCGATGCTGCTCTTCTCGAGAAGAGCAGCATCGAGAAGCCG,n/a
human,9542,NRG2,XR_001742351.1,TRCN0000158276,NM_014483.1-282s1c1,CAGCAACAACAGCAGCAACAA,pLKO.1,514,3UTR,85,95,,,Y,27303,RBMS3,CCGGCAGCAACAACAGCAGCAACAACTCGAGTTGTTGCTGCTGTTGTTGCTGTTTTTG,AATTCAAAAACAGCAACAACAGCAGCAACAACTCGAGTTGTTGCTGCTGTTGTTGCTG,n/a
human,9542,NRG2,XR_001742351.1,TRCN0000097700,NM_133769.1-3865s1c1,GCAGACCTTCAACCTGGAGGA,pLKO.1,1968,3UTR,90,89,,,Y,76884,Cyfip2,CCGGGCAGACCTTCAACCTGGAGGACTCGAGTCCTCCAGGTTGAAGGTCTGCTTTTTG,AATTCAAAAAGCAGACCTTCAACCTGGAGGACTCGAGTCCTCCAGGTTGAAGGTCTGC,n/a
human,9542,NRG2,XR_001742351.1,TRCN0000364564,NM_014779.2-1992s21c1,AGCAGGAGCAGCAGCATAATC,pLKO_005,503,3UTR,85,89,,,Y,9819,TSC22D2,CCGGAGCAGGAGCAGCAGCATAATCCTCGAGGATTATGCTGCTGCTCCTGCTTTTTTG,AATTCAAAAAAGCAGGAGCAGCAGCATAATCCTCGAGGATTATGCTGCTGCTCCTGCT,n/a
human,9542,NRG2,XR_001742351.1,TRCN0000055057,NM_007547.1-847s1c1,TGGTTCAAAGATGGGCAAGAA,pLKO.1,1172,3UTR,85,89,,,Y,19261,Sirpa,CCGGTGGTTCAAAGATGGGCAAGAACTCGAGTTCTTGCCCATCTTTGAACCATTTTTG,AATTCAAAAATGGTTCAAAGATGGGCAAGAACTCGAGTTCTTGCCCATCTTTGAACCA,n/a
human,9542,NRG2,XR_001742351.1,TRCN0000040043,NM_000245.1-4571s1c1,ATCAGAACCAGAGGCTTGGTC,pLKO.1,1633,3UTR,85,89,,,Y,4233,MET,CCGGATCAGAACCAGAGGCTTGGTCCTCGAGGACCAAGCCTCTGGTTCTGATTTTTTG,AATTCAAAAAATCAGAACCAGAGGCTTGGTCCTCGAGGACCAAGCCTCTGGTTCTGAT,n/a
human,9542,NRG2,XR_001742351.1,TRCN0000010379,NM_000245.x-4571s1c1,CATCAGAACCAGAGGCTTGGT,pLKO.1,1632,3UTR,85,89,,,Y,4233,MET,CCGGCATCAGAACCAGAGGCTTGGTCTCGAGACCAAGCCTCTGGTTCTGATGTTTTTG,AATTCAAAAACATCAGAACCAGAGGCTTGGTCTCGAGACCAAGCCTCTGGTTCTGATG,n/a
human,9542,NRG2,XR_001742351.1,TRCN0000166517,NM_198841.1-1386s1c1,CGTTGAAGAAGACGAAGAGCT,pLKO.1,1077,3UTR,85,89,,,Y,158293,FAM120AOS,CCGGCGTTGAAGAAGACGAAGAGCTCTCGAGAGCTCTTCGTCTTCTTCAACGTTTTTG,AATTCAAAAACGTTGAAGAAGACGAAGAGCTCTCGAGAGCTCTTCGTCTTCTTCAACG,n/a
human,9542,NRG2,XR_001742351.1,TRCN0000056425,NM_203458.2-738s1c1,CCAACCAGTTCTCCTGCAAAT,pLKO.1,1458,3UTR,85,89,,,Y,388677,NOTCH2NLA,CCGGCCAACCAGTTCTCCTGCAAATCTCGAGATTTGCAGGAGAACTGGTTGGTTTTTG,AATTCAAAAACCAACCAGTTCTCCTGCAAATCTCGAGATTTGCAGGAGAACTGGTTGG,n/a
human,9542,NRG2,XR_001742351.1,TRCN0000315755,NM_203458.3-741s21c1,CCAACCAGTTCTCCTGCAAAT,pLKO_005,1458,3UTR,85,89,,,Y,388677,NOTCH2NLA,CCGGCCAACCAGTTCTCCTGCAAATCTCGAGATTTGCAGGAGAACTGGTTGGTTTTTG,AATTCAAAAACCAACCAGTTCTCCTGCAAATCTCGAGATTTGCAGGAGAACTGGTTGG,n/a
human,9542,NRG2,XR_001742351.1,TRCN0000431169,NM_005856.2-143s21c1,TGCAACGAGACAGGCATGTTG,pLKO_005,1397,3UTR,80,89,,,Y,10268,RAMP3,CCGGTGCAACGAGACAGGCATGTTGCTCGAGCAACATGCCTGTCTCGTTGCATTTTTG,AATTCAAAAATGCAACGAGACAGGCATGTTGCTCGAGCAACATGCCTGTCTCGTTGCA,n/a
human,9542,NRG2,XR_001742351.1,TRCN0000446527,NM_198447.1-365s21c1,TCCAACGGCACAAACTCAAGG,pLKO_005,1010,3UTR,81,85,,,Y,127845,GOLT1A,CCGGTCCAACGGCACAAACTCAAGGCTCGAGCCTTGAGTTTGTGCCGTTGGATTTTTG,AATTCAAAAATCCAACGGCACAAACTCAAGGCTCGAGCCTTGAGTTTGTGCCGTTGGA,n/a
human,9542,NRG2,XR_001742351.1,TRCN0000148056,NM_020236.2-989s1c1,GTAGTTCAACAAGTGAAGGTT,pLKO.1,1252,3UTR,81,85,,,Y,65008,MRPL1,CCGGGTAGTTCAACAAGTGAAGGTTCTCGAGAACCTTCACTTGTTGAACTACTTTTTG,AATTCAAAAAGTAGTTCAACAAGTGAAGGTTCTCGAGAACCTTCACTTGTTGAACTAC,n/a
human,9542,NRG2,XR_001742351.1,TRCN0000349720,NM_020236.3-1085s21c1,GTAGTTCAACAAGTGAAGGTT,pLKO_005,1252,3UTR,81,85,,,Y,65008,MRPL1,CCGGGTAGTTCAACAAGTGAAGGTTCTCGAGAACCTTCACTTGTTGAACTACTTTTTG,AATTCAAAAAGTAGTTCAACAAGTGAAGGTTCTCGAGAACCTTCACTTGTTGAACTAC,n/a
human,9542,NRG2,XR_001742351.1,TRCN0000239620,XM_001480385.1-142s21c1,CAGAACCACCTCCGCAGATAT,pLKO_005,1599,3UTR,77,85,,,Y,,,CCGGCAGAACCACCTCCGCAGATATCTCGAGATATCTGCGGAGGTGGTTCTGTTTTTG,AATTCAAAAACAGAACCACCTCCGCAGATATCTCGAGATATCTGCGGAGGTGGTTCTG,n/a
human,9542,NRG2,XR_001742351.1,TRCN0000427327,NM_004355.2-501s21c1,GAGAACCTGAGACACCTTAAG,pLKO_005,1747,3UTR,77,85,,,Y,972,CD74,CCGGGAGAACCTGAGACACCTTAAGCTCGAGCTTAAGGTGTCTCAGGTTCTCTTTTTG,AATTCAAAAAGAGAACCTGAGACACCTTAAGCTCGAGCTTAAGGTGTCTCAGGTTCTC,n/a
human,9542,NRG2,XR_001742351.1,TRCN0000016112,NM_004527.2-152s1c1,CCCGTTCTCCTTCCACCAGAA,pLKO.1,1780,3UTR,77,85,,,Y,4222,MEOX1,CCGGCCCGTTCTCCTTCCACCAGAACTCGAGTTCTGGTGGAAGGAGAACGGGTTTTTG,AATTCAAAAACCCGTTCTCCTTCCACCAGAACTCGAGTTCTGGTGGAAGGAGAACGGG,n/a
