Taxon,"Gene ID","Gene Symbol",Transcript,"Clone ID","Legacy Clone Name","Target Seq",Vector,"Match Position","Match Region","Match %","SDR Match %","Intrinsic Score","Adjusted Score","Matches Other Gene in Same Taxon?","Orig. Target Gene ID","Orig. Target Gene Symbol","Forward Oligo Sequence","Reverse Oligo Sequence",Addgene
human,158046,NXNL2,XR_001746187.1,TRCN0000422820,NM_145283.2-471s21c1,CGCTGCTCTGCGACTTCTATA,pLKO_005,482,3UTR,100,100,13.2,9.24,N,158046,NXNL2,CCGGCGCTGCTCTGCGACTTCTATACTCGAGTATAGAAGTCGCAGAGCAGCGTTTTTG,AATTCAAAAACGCTGCTCTGCGACTTCTATACTCGAGTATAGAAGTCGCAGAGCAGCG,n/a
human,158046,NXNL2,XR_001746187.1,TRCN0000414072,NM_145283.2-411s21c1,ACAAGGTGGTGGCACTGTACT,pLKO_005,422,3UTR,100,100,4.95,3.465,N,158046,NXNL2,CCGGACAAGGTGGTGGCACTGTACTCTCGAGAGTACAGTGCCACCACCTTGTTTTTTG,AATTCAAAAAACAAGGTGGTGGCACTGTACTCTCGAGAGTACAGTGCCACCACCTTGT,n/a
human,158046,NXNL2,XR_001746187.1,TRCN0000114360,NM_029173.1-446s1c1,CGACTTCTACACGGAGCTGGT,pLKO.1,492,3UTR,90,89,,,Y,75124,Nxnl2,CCGGCGACTTCTACACGGAGCTGGTCTCGAGACCAGCTCCGTGTAGAAGTCGTTTTTG,AATTCAAAAACGACTTCTACACGGAGCTGGTCTCGAGACCAGCTCCGTGTAGAAGTCG,n/a
human,158046,NXNL2,XR_001746187.1,TRCN0000360609,NM_030612.3-2710s21c1,CCAGGTATCTGGGATCTATAT,pLKO_005,112,3UTR,80,89,,,Y,80859,Nfkbiz,CCGGCCAGGTATCTGGGATCTATATCTCGAGATATAGATCCCAGATACCTGGTTTTTG,AATTCAAAAACCAGGTATCTGGGATCTATATCTCGAGATATAGATCCCAGATACCTGG,n/a
human,158046,NXNL2,XR_001746187.1,TRCN0000141867,NM_014745.1-2204s1c1,GTACAACGTCACCGTCATCAT,pLKO.1,843,3UTR,80,89,,,Y,9780,PIEZO1,CCGGGTACAACGTCACCGTCATCATCTCGAGATGATGACGGTGACGTTGTACTTTTTG,AATTCAAAAAGTACAACGTCACCGTCATCATCTCGAGATGATGACGGTGACGTTGTAC,n/a
human,158046,NXNL2,XR_001746187.1,TRCN0000242301,XM_357358.3-719s21c1,AGGAGATGATGGGCTTCATTT,pLKO_005,575,3UTR,80,89,,,Y,383977,Spopfm3,CCGGAGGAGATGATGGGCTTCATTTCTCGAGAAATGAAGCCCATCATCTCCTTTTTTG,AATTCAAAAAAGGAGATGATGGGCTTCATTTCTCGAGAAATGAAGCCCATCATCTCCT,n/a
human,158046,NXNL2,XR_001746187.1,TRCN0000355655,NM_013276.2-1945s21c1,CATGCCCAGCTTGTGATTATC,pLKO_005,858,3UTR,81,85,,,Y,23729,SHPK,CCGGCATGCCCAGCTTGTGATTATCCTCGAGGATAATCACAAGCTGGGCATGTTTTTG,AATTCAAAAACATGCCCAGCTTGTGATTATCCTCGAGGATAATCACAAGCTGGGCATG,n/a
human,158046,NXNL2,XR_001746187.1,TRCN0000276973,NM_145605.1-1901s21c1,GAGTGGTCTTCTGTGAGCCTT,pLKO_005,542,3UTR,77,85,,,Y,234825,Klhdc4,CCGGGAGTGGTCTTCTGTGAGCCTTCTCGAGAAGGCTCACAGAAGACCACTCTTTTTG,AATTCAAAAAGAGTGGTCTTCTGTGAGCCTTCTCGAGAAGGCTCACAGAAGACCACTC,n/a
