Taxon,"Gene ID","Gene Symbol",Transcript,"Clone ID","Legacy Clone Name","Target Seq",Vector,"Match Position","Match Region","Match %","SDR Match %","Intrinsic Score","Adjusted Score","Matches Other Gene in Same Taxon?","Orig. Target Gene ID","Orig. Target Gene Symbol","Forward Oligo Sequence","Reverse Oligo Sequence",Addgene
human,107984344,LOC107984344,XR_001748282.2,TRCN0000264189,NM_001085490.1-613s21c1,CAAGTAGCTGGGACTACAGGA,pLKO_005,141,3UTR,90,95,,,Y,285501,LINC01098,CCGGCAAGTAGCTGGGACTACAGGACTCGAGTCCTGTAGTCCCAGCTACTTGTTTTTG,AATTCAAAAACAAGTAGCTGGGACTACAGGACTCGAGTCCTGTAGTCCCAGCTACTTG,n/a
human,107984344,LOC107984344,XR_001748282.2,TRCN0000084478,NM_178744.1-2956s1c1,GCTGTTTCTATGTACTTTCAT,pLKO.1,368,3UTR,90,89,,,Y,268564,Zbtb1,CCGGGCTGTTTCTATGTACTTTCATCTCGAGATGAAAGTACATAGAAACAGCTTTTTG,AATTCAAAAAGCTGTTTCTATGTACTTTCATCTCGAGATGAAAGTACATAGAAACAGC,n/a
human,107984344,LOC107984344,XR_001748282.2,TRCN0000040691,NM_009277.2-1499s1c1,CCTCTAAAGCTCTGTCCACTA,pLKO.1,771,3UTR,90,89,,,Y,20821,Trim21,CCGGCCTCTAAAGCTCTGTCCACTACTCGAGTAGTGGACAGAGCTTTAGAGGTTTTTG,AATTCAAAAACCTCTAAAGCTCTGTCCACTACTCGAGTAGTGGACAGAGCTTTAGAGG,n/a
human,107984344,LOC107984344,XR_001748282.2,TRCN0000150833,NM_207309.1-2994s1c1,GCCTGGCTAATTCTTTGTATT,pLKO.1,174,3UTR,90,89,,,Y,91373,UAP1L1,CCGGGCCTGGCTAATTCTTTGTATTCTCGAGAATACAAAGAATTAGCCAGGCTTTTTG,AATTCAAAAAGCCTGGCTAATTCTTTGTATTCTCGAGAATACAAAGAATTAGCCAGGC,n/a
human,107984344,LOC107984344,XR_001748282.2,TRCN0000165534,NM_001012717.1-362s1c1,GAGACAGGGTTTCACCATGTT,pLKO.1,202,3UTR,90,89,,,Y,,,CCGGGAGACAGGGTTTCACCATGTTCTCGAGAACATGGTGAAACCCTGTCTCTTTTTG,AATTCAAAAAGAGACAGGGTTTCACCATGTTCTCGAGAACATGGTGAAACCCTGTCTC,n/a
human,107984344,LOC107984344,XR_001748282.2,TRCN0000073773,NM_022164.1-1914s1c1,CCTCTCAAGTAGCTGGGACTA,pLKO.1,136,3UTR,90,89,,,Y,64129,TINAGL1,CCGGCCTCTCAAGTAGCTGGGACTACTCGAGTAGTCCCAGCTACTTGAGAGGTTTTTG,AATTCAAAAACCTCTCAAGTAGCTGGGACTACTCGAGTAGTCCCAGCTACTTGAGAGG,n/a
human,107984344,LOC107984344,XR_001748282.2,TRCN0000112015,NM_009694.1-868s1c1,CCTGGCTTCCTGATTCTACTT,pLKO.1,845,3UTR,85,89,,,Y,11811,Apobec2,CCGGCCTGGCTTCCTGATTCTACTTCTCGAGAAGTAGAATCAGGAAGCCAGGTTTTTG,AATTCAAAAACCTGGCTTCCTGATTCTACTTCTCGAGAAGTAGAATCAGGAAGCCAGG,n/a
human,107984344,LOC107984344,XR_001748282.2,TRCN0000262474,NM_001042507.3-199s21c1,TCTTCAACAGCAAGGAGCAAG,pLKO_005,810,3UTR,85,89,,,Y,653499,LGALS7B,CCGGTCTTCAACAGCAAGGAGCAAGCTCGAGCTTGCTCCTTGCTGTTGAAGATTTTTG,AATTCAAAAATCTTCAACAGCAAGGAGCAAGCTCGAGCTTGCTCCTTGCTGTTGAAGA,n/a
human,107984344,LOC107984344,XR_001748282.2,TRCN0000172742,NM_173580.1-340s1c1,GAGACAGAGTCTTGCTCTGTT,pLKO.1,28,3UTR,85,89,,,Y,283171,C11orf44,CCGGGAGACAGAGTCTTGCTCTGTTCTCGAGAACAGAGCAAGACTCTGTCTCTTTTTG,AATTCAAAAAGAGACAGAGTCTTGCTCTGTTCTCGAGAACAGAGCAAGACTCTGTCTC,n/a
human,107984344,LOC107984344,XR_001748282.2,TRCN0000040158,NM_017489.1-1753s1c1,GCGCAATTTCAGCTCACTGAA,pLKO.1,76,3UTR,85,89,,,Y,7013,TERF1,CCGGGCGCAATTTCAGCTCACTGAACTCGAGTTCAGTGAGCTGAAATTGCGCTTTTTG,AATTCAAAAAGCGCAATTTCAGCTCACTGAACTCGAGTTCAGTGAGCTGAAATTGCGC,n/a
human,107984344,LOC107984344,XR_001748282.2,TRCN0000270969,NM_001045544.1-96s21c1,TTTATATGTAGTCATCATAGG,pLKO_005,318,3UTR,80,89,,,N,632793,Vmn1r204,CCGGTTTATATGTAGTCATCATAGGCTCGAGCCTATGATGACTACATATAAATTTTTG,AATTCAAAAATTTATATGTAGTCATCATAGGCTCGAGCCTATGATGACTACATATAAA,n/a
human,107984344,LOC107984344,XR_001748282.2,TRCN0000063879,NM_016379.2-836s1c1,GAGAGCGAGATGGAAGAACTA,pLKO.1,742,3UTR,80,89,,,Y,51481,VCX3A,CCGGGAGAGCGAGATGGAAGAACTACTCGAGTAGTTCTTCCATCTCGCTCTCTTTTTG,AATTCAAAAAGAGAGCGAGATGGAAGAACTACTCGAGTAGTTCTTCCATCTCGCTCTC,n/a
human,107984344,LOC107984344,XR_001748282.2,TRCN0000156598,NM_001001888.1-926s1c1,GAGAGCGAGATGGAAGAACTA,pLKO.1,742,3UTR,80,89,,,Y,425054,VCX3B,CCGGGAGAGCGAGATGGAAGAACTACTCGAGTAGTTCTTCCATCTCGCTCTCTTTTTG,AATTCAAAAAGAGAGCGAGATGGAAGAACTACTCGAGTAGTTCTTCCATCTCGCTCTC,n/a
human,107984344,LOC107984344,XR_001748282.2,TRCN0000145259,NM_130830.2-2502s1c1,GCTATGAAAGAGAGAAGGAAA,pLKO.1,682,3UTR,77,85,,,Y,131578,LRRC15,CCGGGCTATGAAAGAGAGAAGGAAACTCGAGTTTCCTTCTCTCTTTCATAGCTTTTTG,AATTCAAAAAGCTATGAAAGAGAGAAGGAAACTCGAGTTTCCTTCTCTCTTTCATAGC,n/a
