Taxon,"Gene ID","Gene Symbol",Transcript,"Clone ID","Legacy Clone Name","Target Seq",Vector,"Match Position","Match Region","Match %","SDR Match %","Intrinsic Score","Adjusted Score","Matches Other Gene in Same Taxon?","Orig. Target Gene ID","Orig. Target Gene Symbol","Forward Oligo Sequence","Reverse Oligo Sequence",Addgene
human,107984570,LINC00444,XR_001749868.2,TRCN0000155836,NM_198582.1-3275s1c1,CCCAAAGTGCTGGGATTACAA,pLKO.1,104,3UTR,95,100,5.625,2.8125,Y,377007,KLHL30,CCGGCCCAAAGTGCTGGGATTACAACTCGAGTTGTAATCCCAGCACTTTGGGTTTTTG,AATTCAAAAACCCAAAGTGCTGGGATTACAACTCGAGTTGTAATCCCAGCACTTTGGG,n/a
human,107984570,LINC00444,XR_001749868.2,TRCN0000141025,NM_152361.1-835s1c1,CCCAAAGTGCTGGGATTACTT,pLKO.1,104,3UTR,90,100,5.625,2.8125,Y,126272,EID2B,CCGGCCCAAAGTGCTGGGATTACTTCTCGAGAAGTAATCCCAGCACTTTGGGTTTTTG,AATTCAAAAACCCAAAGTGCTGGGATTACTTCTCGAGAAGTAATCCCAGCACTTTGGG,n/a
human,107984570,LINC00444,XR_001749868.2,TRCN0000204533,NM_001013675.1-1987s1c1,CCTCCCAAAGTGCTGGAATTA,pLKO.1,101,3UTR,95,95,,,Y,400891,LRRC74B,CCGGCCTCCCAAAGTGCTGGAATTACTCGAGTAATTCCAGCACTTTGGGAGGTTTTTG,AATTCAAAAACCTCCCAAAGTGCTGGAATTACTCGAGTAATTCCAGCACTTTGGGAGG,n/a
human,107984570,LINC00444,XR_001749868.2,TRCN0000072628,NM_016065.3-1636s1c1,CCTCCCAAAGTGCTAGGATTA,pLKO.1,101,3UTR,95,95,,,Y,51021,MRPS16,CCGGCCTCCCAAAGTGCTAGGATTACTCGAGTAATCCTAGCACTTTGGGAGGTTTTTG,AATTCAAAAACCTCCCAAAGTGCTAGGATTACTCGAGTAATCCTAGCACTTTGGGAGG,n/a
human,107984570,LINC00444,XR_001749868.2,TRCN0000165534,NM_001012717.1-362s1c1,GAGACAGGGTTTCACCATGTT,pLKO.1,33,3UTR,95,95,,,Y,,,CCGGGAGACAGGGTTTCACCATGTTCTCGAGAACATGGTGAAACCCTGTCTCTTTTTG,AATTCAAAAAGAGACAGGGTTTCACCATGTTCTCGAGAACATGGTGAAACCCTGTCTC,n/a
human,107984570,LINC00444,XR_001749868.2,TRCN0000164801,NM_016534.2-1646s1c1,CCTCCCAAAGTACTGGGATTA,pLKO.1,101,3UTR,95,95,,,Y,51275,MAPKAPK5-AS1,CCGGCCTCCCAAAGTACTGGGATTACTCGAGTAATCCCAGTACTTTGGGAGGTTTTTG,AATTCAAAAACCTCCCAAAGTACTGGGATTACTCGAGTAATCCCAGTACTTTGGGAGG,n/a
human,107984570,LINC00444,XR_001749868.2,TRCN0000008902,NM_016540.2-2291s1c1,CCTCCCAAAGTGTTGGGATTA,pLKO.1,101,3UTR,95,95,,,Y,10888,GPR83,CCGGCCTCCCAAAGTGTTGGGATTACTCGAGTAATCCCAACACTTTGGGAGGTTTTTG,AATTCAAAAACCTCCCAAAGTGTTGGGATTACTCGAGTAATCCCAACACTTTGGGAGG,n/a
human,107984570,LINC00444,XR_001749868.2,TRCN0000156315,NM_020702.1-3633s1c1,CCTCCCAAAGTGTTGGGATTA,pLKO.1,101,3UTR,95,95,,,Y,57462,MYORG,CCGGCCTCCCAAAGTGTTGGGATTACTCGAGTAATCCCAACACTTTGGGAGGTTTTTG,AATTCAAAAACCTCCCAAAGTGTTGGGATTACTCGAGTAATCCCAACACTTTGGGAGG,n/a
human,107984570,LINC00444,XR_001749868.2,TRCN0000116227,NM_024930.1-2895s1c1,CCTCCCAAAGTTCTGGGATTA,pLKO.1,101,3UTR,95,95,,,Y,79993,ELOVL7,CCGGCCTCCCAAAGTTCTGGGATTACTCGAGTAATCCCAGAACTTTGGGAGGTTTTTG,AATTCAAAAACCTCCCAAAGTTCTGGGATTACTCGAGTAATCCCAGAACTTTGGGAGG,n/a
human,107984570,LINC00444,XR_001749868.2,TRCN0000164591,NM_003281.3-2102s1c1,CCTCCCAAAGTTCTGGGATTA,pLKO.1,101,3UTR,95,95,,,Y,7135,TNNI1,CCGGCCTCCCAAAGTTCTGGGATTACTCGAGTAATCCCAGAACTTTGGGAGGTTTTTG,AATTCAAAAACCTCCCAAAGTTCTGGGATTACTCGAGTAATCCCAGAACTTTGGGAGG,n/a
human,107984570,LINC00444,XR_001749868.2,TRCN0000040213,NM_000618.2-6169s1c1,CCTCCCAAATTGCTGGGATTA,pLKO.1,101,3UTR,95,95,,,Y,3479,IGF1,CCGGCCTCCCAAATTGCTGGGATTACTCGAGTAATCCCAGCAATTTGGGAGGTTTTTG,AATTCAAAAACCTCCCAAATTGCTGGGATTACTCGAGTAATCCCAGCAATTTGGGAGG,n/a
human,107984570,LINC00444,XR_001749868.2,TRCN0000162795,NM_017842.1-1079s1c1,CTTCCAAAGTGCTGGGATTAT,pLKO.1,102,3UTR,90,95,,,Y,55652,SLC48A1,CCGGCTTCCAAAGTGCTGGGATTATCTCGAGATAATCCCAGCACTTTGGAAGTTTTTG,AATTCAAAAACTTCCAAAGTGCTGGGATTATCTCGAGATAATCCCAGCACTTTGGAAG,n/a
human,107984570,LINC00444,XR_001749868.2,TRCN0000165230,NM_001004336.1-1551s1c1,GCAGTGGCTTACACCTGTAAT,pLKO.1,2751,3UTR,90,95,,,Y,440465,BAIAP2-DT,CCGGGCAGTGGCTTACACCTGTAATCTCGAGATTACAGGTGTAAGCCACTGCTTTTTG,AATTCAAAAAGCAGTGGCTTACACCTGTAATCTCGAGATTACAGGTGTAAGCCACTGC,n/a
human,107984570,LINC00444,XR_001749868.2,TRCN0000140657,NM_012099.1-2957s1c1,CCTCCCAAAGTGCTAGGATAA,pLKO.1,101,3UTR,90,95,,,Y,10849,CD3EAP,CCGGCCTCCCAAAGTGCTAGGATAACTCGAGTTATCCTAGCACTTTGGGAGGTTTTTG,AATTCAAAAACCTCCCAAAGTGCTAGGATAACTCGAGTTATCCTAGCACTTTGGGAGG,n/a
human,107984570,LINC00444,XR_001749868.2,TRCN0000047783,NM_017516.1-1624s1c1,GCCTCCAAAGTGCTGGAATTA,pLKO.1,100,3UTR,90,90,,,Y,54734,RAB39A,CCGGGCCTCCAAAGTGCTGGAATTACTCGAGTAATTCCAGCACTTTGGAGGCTTTTTG,AATTCAAAAAGCCTCCAAAGTGCTGGAATTACTCGAGTAATTCCAGCACTTTGGAGGC,n/a
human,107984570,LINC00444,XR_001749868.2,TRCN0000091448,NM_013513.1-2495s1c1,CCTCCCAAGTACTGGGATTAA,pLKO.1,101,3UTR,86,90,,,Y,13828,Epb42,CCGGCCTCCCAAGTACTGGGATTAACTCGAGTTAATCCCAGTACTTGGGAGGTTTTTG,AATTCAAAAACCTCCCAAGTACTGGGATTAACTCGAGTTAATCCCAGTACTTGGGAGG,n/a
human,107984570,LINC00444,XR_001749868.2,TRCN0000127495,NM_013304.1-822s1c1,CAAGTGGCTCAACAACTGTGT,pLKO.1,970,3UTR,81,90,,,Y,29800,ZDHHC1,CCGGCAAGTGGCTCAACAACTGTGTCTCGAGACACAGTTGTTGAGCCACTTGTTTTTG,AATTCAAAAACAAGTGGCTCAACAACTGTGTCTCGAGACACAGTTGTTGAGCCACTTG,n/a
human,107984570,LINC00444,XR_001749868.2,TRCN0000235383,NM_002017.3-930s21c1,AGTTCACTGCTGGCCTATAAT,pLKO_005,1551,3UTR,90,89,,,Y,2313,FLI1,CCGGAGTTCACTGCTGGCCTATAATCTCGAGATTATAGGCCAGCAGTGAACTTTTTTG,AATTCAAAAAAGTTCACTGCTGGCCTATAATCTCGAGATTATAGGCCAGCAGTGAACT,n/a
human,107984570,LINC00444,XR_001749868.2,TRCN0000042823,NM_024055.2-973s1c1,CCTCACAAAGTGCTAGGATTA,pLKO.1,101,3UTR,90,89,,,Y,64924,SLC30A5,CCGGCCTCACAAAGTGCTAGGATTACTCGAGTAATCCTAGCACTTTGTGAGGTTTTTG,AATTCAAAAACCTCACAAAGTGCTAGGATTACTCGAGTAATCCTAGCACTTTGTGAGG,n/a
human,107984570,LINC00444,XR_001749868.2,TRCN0000082462,XM_371492.2-638s1c1,CCTCCCAAAGTGCCAGGATTA,pLKO.1,101,3UTR,90,89,,,Y,388949,LOC388949,CCGGCCTCCCAAAGTGCCAGGATTACTCGAGTAATCCTGGCACTTTGGGAGGTTTTTG,AATTCAAAAACCTCCCAAAGTGCCAGGATTACTCGAGTAATCCTGGCACTTTGGGAGG,n/a
human,107984570,LINC00444,XR_001749868.2,TRCN0000165736,NM_175901.3-1946s1c1,CCTCCCTAAGTGTTGGGATTA,pLKO.1,101,3UTR,90,89,,,Y,283932,FBXL19-AS1,CCGGCCTCCCTAAGTGTTGGGATTACTCGAGTAATCCCAACACTTAGGGAGGTTTTTG,AATTCAAAAACCTCCCTAAGTGTTGGGATTACTCGAGTAATCCCAACACTTAGGGAGG,n/a
human,107984570,LINC00444,XR_001749868.2,TRCN0000166560,NM_207497.1-412s1c1,CCTCCGAAAGTGCTAGGATTA,pLKO.1,101,3UTR,90,89,,,Y,401253,LINC00336,CCGGCCTCCGAAAGTGCTAGGATTACTCGAGTAATCCTAGCACTTTCGGAGGTTTTTG,AATTCAAAAACCTCCGAAAGTGCTAGGATTACTCGAGTAATCCTAGCACTTTCGGAGG,n/a
human,107984570,LINC00444,XR_001749868.2,TRCN0000164091,NM_024795.1-1273s1c1,CCTCCTAAAGTGCTGCGATTA,pLKO.1,101,3UTR,90,89,,,Y,79853,TM4SF20,CCGGCCTCCTAAAGTGCTGCGATTACTCGAGTAATCGCAGCACTTTAGGAGGTTTTTG,AATTCAAAAACCTCCTAAAGTGCTGCGATTACTCGAGTAATCGCAGCACTTTAGGAGG,n/a
human,107984570,LINC00444,XR_001749868.2,TRCN0000162985,NM_207497.1-342s1c1,GAGACAAGGTTTCACCATGTT,pLKO.1,33,3UTR,90,89,,,Y,401253,LINC00336,CCGGGAGACAAGGTTTCACCATGTTCTCGAGAACATGGTGAAACCTTGTCTCTTTTTG,AATTCAAAAAGAGACAAGGTTTCACCATGTTCTCGAGAACATGGTGAAACCTTGTCTC,n/a
human,107984570,LINC00444,XR_001749868.2,TRCN0000140238,NM_024895.3-1807s1c1,GTCTCCCAAAGTGCTAGGATT,pLKO.1,100,3UTR,90,89,,,Y,79955,PDZD7,CCGGGTCTCCCAAAGTGCTAGGATTCTCGAGAATCCTAGCACTTTGGGAGACTTTTTG,AATTCAAAAAGTCTCCCAAAGTGCTAGGATTCTCGAGAATCCTAGCACTTTGGGAGAC,n/a
human,107984570,LINC00444,XR_001749868.2,TRCN0000129445,NM_145048.2-1500s1c1,GACTTCCAAAGTGCTGGGATT,pLKO.1,100,3UTR,90,89,,,Y,133015,PACRGL,CCGGGACTTCCAAAGTGCTGGGATTCTCGAGAATCCCAGCACTTTGGAAGTCTTTTTG,AATTCAAAAAGACTTCCAAAGTGCTGGGATTCTCGAGAATCCCAGCACTTTGGAAGTC,n/a
human,107984570,LINC00444,XR_001749868.2,TRCN0000140759,NM_018265.1-3067s1c1,GCCTTTCAAAGTGCTGGGATT,pLKO.1,100,3UTR,90,89,,,Y,55765,INAVA,CCGGGCCTTTCAAAGTGCTGGGATTCTCGAGAATCCCAGCACTTTGAAAGGCTTTTTG,AATTCAAAAAGCCTTTCAAAGTGCTGGGATTCTCGAGAATCCCAGCACTTTGAAAGGC,n/a
human,107984570,LINC00444,XR_001749868.2,TRCN0000155070,NM_017873.2-2761s1c1,GCCTTTCAAAGTGCTGGGATT,pLKO.1,100,3UTR,90,89,,,Y,140459,ASB6,CCGGGCCTTTCAAAGTGCTGGGATTCTCGAGAATCCCAGCACTTTGAAAGGCTTTTTG,AATTCAAAAAGCCTTTCAAAGTGCTGGGATTCTCGAGAATCCCAGCACTTTGAAAGGC,n/a
human,107984570,LINC00444,XR_001749868.2,TRCN0000165025,NM_207497.1-421s1c1,GTGCTAGGATTATAGGCGTGA,pLKO.1,110,3UTR,90,89,,,Y,401253,LINC00336,CCGGGTGCTAGGATTATAGGCGTGACTCGAGTCACGCCTATAATCCTAGCACTTTTTG,AATTCAAAAAGTGCTAGGATTATAGGCGTGACTCGAGTCACGCCTATAATCCTAGCAC,n/a
human,107984570,LINC00444,XR_001749868.2,TRCN0000163829,NM_173639.1-1102s1c1,CCTCCCAAATTACTGGGATTA,pLKO.1,101,3UTR,90,89,,,Y,284618,RUSC1-AS1,CCGGCCTCCCAAATTACTGGGATTACTCGAGTAATCCCAGTAATTTGGGAGGTTTTTG,AATTCAAAAACCTCCCAAATTACTGGGATTACTCGAGTAATCCCAGTAATTTGGGAGG,n/a
human,107984570,LINC00444,XR_001749868.2,TRCN0000057398,NM_002261.1-793s1c1,CCTCCCAAGTTGCTGGGATTA,pLKO.1,101,3UTR,90,89,,,Y,3823,KLRC3,CCGGCCTCCCAAGTTGCTGGGATTACTCGAGTAATCCCAGCAACTTGGGAGGTTTTTG,AATTCAAAAACCTCCCAAGTTGCTGGGATTACTCGAGTAATCCCAGCAACTTGGGAGG,n/a
human,107984570,LINC00444,XR_001749868.2,TRCN0000140374,NM_025042.2-1098s1c1,GCTTCCCAAAGTACTGGGATT,pLKO.1,100,3UTR,90,89,,,Y,,,CCGGGCTTCCCAAAGTACTGGGATTCTCGAGAATCCCAGTACTTTGGGAAGCTTTTTG,AATTCAAAAAGCTTCCCAAAGTACTGGGATTCTCGAGAATCCCAGTACTTTGGGAAGC,n/a
human,107984570,LINC00444,XR_001749868.2,TRCN0000167678,NM_019051.1-258s1c1,GTTCATCTCTTCCTAGTAATT,pLKO.1,181,3UTR,85,89,,,Y,54534,MRPL50,CCGGGTTCATCTCTTCCTAGTAATTCTCGAGAATTACTAGGAAGAGATGAACTTTTTG,AATTCAAAAAGTTCATCTCTTCCTAGTAATTCTCGAGAATTACTAGGAAGAGATGAAC,n/a
human,107984570,LINC00444,XR_001749868.2,TRCN0000240863,NM_019051.2-281s21c1,GTTCATCTCTTCCTAGTAATT,pLKO_005,181,3UTR,85,89,,,Y,54534,MRPL50,CCGGGTTCATCTCTTCCTAGTAATTCTCGAGAATTACTAGGAAGAGATGAACTTTTTG,AATTCAAAAAGTTCATCTCTTCCTAGTAATTCTCGAGAATTACTAGGAAGAGATGAAC,n/a
human,107984570,LINC00444,XR_001749868.2,TRCN0000421501,NM_014961.3-1497s21c1,TTGCAAACAACAGGATCATTA,pLKO_005,1484,3UTR,85,89,,,Y,22902,RUFY3,CCGGTTGCAAACAACAGGATCATTACTCGAGTAATGATCCTGTTGTTTGCAATTTTTG,AATTCAAAAATTGCAAACAACAGGATCATTACTCGAGTAATGATCCTGTTGTTTGCAA,n/a
human,107984570,LINC00444,XR_001749868.2,TRCN0000141843,NM_012288.2-2624s1c1,GCAGTAGCTTACGCCTGTTAT,pLKO.1,2751,3UTR,85,89,,,Y,9697,TRAM2,CCGGGCAGTAGCTTACGCCTGTTATCTCGAGATAACAGGCGTAAGCTACTGCTTTTTG,AATTCAAAAAGCAGTAGCTTACGCCTGTTATCTCGAGATAACAGGCGTAAGCTACTGC,n/a
human,107984570,LINC00444,XR_001749868.2,TRCN0000165026,NM_001012391.1-1008s1c1,GTAGAGAAAGGGTTTCGCCAT,pLKO.1,30,3UTR,85,89,,,Y,100652781,SNX29P1,CCGGGTAGAGAAAGGGTTTCGCCATCTCGAGATGGCGAAACCCTTTCTCTACTTTTTG,AATTCAAAAAGTAGAGAAAGGGTTTCGCCATCTCGAGATGGCGAAACCCTTTCTCTAC,n/a
human,107984570,LINC00444,XR_001749868.2,TRCN0000088223,NM_007964.1-3907s1c1,CCCGCTAAATTCTTGTATTTA,pLKO.1,7,3UTR,85,89,,,Y,14020,Evi5,CCGGCCCGCTAAATTCTTGTATTTACTCGAGTAAATACAAGAATTTAGCGGGTTTTTG,AATTCAAAAACCCGCTAAATTCTTGTATTTACTCGAGTAAATACAAGAATTTAGCGGG,n/a
human,107984570,LINC00444,XR_001749868.2,TRCN0000445102,NM_018679.4-1634s21c1,TGGTGTGCAGCGGTCTCTATT,pLKO_005,1690,3UTR,80,89,,,Y,6954,TCP11,CCGGTGGTGTGCAGCGGTCTCTATTCTCGAGAATAGAGACCGCTGCACACCATTTTTG,AATTCAAAAATGGTGTGCAGCGGTCTCTATTCTCGAGAATAGAGACCGCTGCACACCA,n/a
human,107984570,LINC00444,XR_001749868.2,TRCN0000161968,NM_080752.1-507s1c1,GCACATACATGGTGACTCTAA,pLKO.1,536,3UTR,80,89,,,Y,140831,ZSWIM3,CCGGGCACATACATGGTGACTCTAACTCGAGTTAGAGTCACCATGTATGTGCTTTTTG,AATTCAAAAAGCACATACATGGTGACTCTAACTCGAGTTAGAGTCACCATGTATGTGC,n/a
human,107984570,LINC00444,XR_001749868.2,TRCN0000135266,NM_018076.2-287s1c1,CCTCAGCATTTGAATCAGGTT,pLKO.1,1212,3UTR,80,89,,,Y,55130,ARMC4,CCGGCCTCAGCATTTGAATCAGGTTCTCGAGAACCTGATTCAAATGCTGAGGTTTTTG,AATTCAAAAACCTCAGCATTTGAATCAGGTTCTCGAGAACCTGATTCAAATGCTGAGG,n/a
human,107984570,LINC00444,XR_001749868.2,TRCN0000215470,NM_145511.2-1433s1c1,GTAATGTTATGTGACTATAAG,pLKO.1,1319,3UTR,80,89,,,Y,226499,BC003331,CCGGGTAATGTTATGTGACTATAAGCTCGAGCTTATAGTCACATAACATTACTTTTTG,AATTCAAAAAGTAATGTTATGTGACTATAAGCTCGAGCTTATAGTCACATAACATTAC,n/a
human,107984570,LINC00444,XR_001749868.2,TRCN0000041201,NM_153110.2-519s1c1,GCTGTTCTGTCTGTAAGGAAT,pLKO.1,1084,3UTR,80,89,,,Y,260296,Trim61,CCGGGCTGTTCTGTCTGTAAGGAATCTCGAGATTCCTTACAGACAGAACAGCTTTTTG,AATTCAAAAAGCTGTTCTGTCTGTAAGGAATCTCGAGATTCCTTACAGACAGAACAGC,n/a
human,107984570,LINC00444,XR_001749868.2,TRCN0000093441,NM_013757.1-826s1c1,CCAGGAGAGATTCTCTGGATA,pLKO.1,1791,3UTR,81,85,,,Y,27359,Sytl4,CCGGCCAGGAGAGATTCTCTGGATACTCGAGTATCCAGAGAATCTCTCCTGGTTTTTG,AATTCAAAAACCAGGAGAGATTCTCTGGATACTCGAGTATCCAGAGAATCTCTCCTGG,n/a
human,107984570,LINC00444,XR_001749868.2,TRCN0000221424,NM_001918.1-503s1c2,CCAAGAGATAAAGGGCCGAAA,pLKO.1,1825,3UTR,81,85,,,Y,1629,DBT,CCGGCCAAGAGATAAAGGGCCGAAACTCGAGTTTCGGCCCTTTATCTCTTGGTTTTTG,AATTCAAAAACCAAGAGATAAAGGGCCGAAACTCGAGTTTCGGCCCTTTATCTCTTGG,n/a
human,107984570,LINC00444,XR_001749868.2,TRCN0000319136,NM_001918.2-522s21c1,CCAAGAGATAAAGGGCCGAAA,pLKO_005,1825,3UTR,81,85,,,Y,1629,DBT,CCGGCCAAGAGATAAAGGGCCGAAACTCGAGTTTCGGCCCTTTATCTCTTGGTTTTTG,AATTCAAAAACCAAGAGATAAAGGGCCGAAACTCGAGTTTCGGCCCTTTATCTCTTGG,n/a
human,107984570,LINC00444,XR_001749868.2,TRCN0000052204,NM_004659.1-981s1c1,CCAGAAGATCCTCCACAAGAA,pLKO.1,1735,3UTR,77,85,,,Y,8511,MMP23A,CCGGCCAGAAGATCCTCCACAAGAACTCGAGTTCTTGTGGAGGATCTTCTGGTTTTTG,AATTCAAAAACCAGAAGATCCTCCACAAGAACTCGAGTTCTTGTGGAGGATCTTCTGG,n/a
