Taxon,"Gene ID","Gene Symbol",Transcript,"Clone ID","Legacy Clone Name","Target Seq",Vector,"Match Position","Match Region","Match %","SDR Match %","Intrinsic Score","Adjusted Score","Matches Other Gene in Same Taxon?","Orig. Target Gene ID","Orig. Target Gene Symbol","Forward Oligo Sequence","Reverse Oligo Sequence",Addgene
human,284001,CCDC57,XR_001752489.2,TRCN0000167936,NM_198082.1-962s1c1,CGGGAGCTTAAGGTTAAACTA,pLKO.1,870,3UTR,100,100,5.625,7.875,N,284001,CCDC57,CCGGCGGGAGCTTAAGGTTAAACTACTCGAGTAGTTTAACCTTAAGCTCCCGTTTTTG,AATTCAAAAACGGGAGCTTAAGGTTAAACTACTCGAGTAGTTTAACCTTAAGCTCCCG,n/a
human,284001,CCDC57,XR_001752489.2,TRCN0000173053,NM_198082.1-1549s1c1,CCAGCAGGACATTGAAAGGTA,pLKO.1,1457,3UTR,100,100,3,4.2,N,284001,CCDC57,CCGGCCAGCAGGACATTGAAAGGTACTCGAGTACCTTTCAATGTCCTGCTGGTTTTTG,AATTCAAAAACCAGCAGGACATTGAAAGGTACTCGAGTACCTTTCAATGTCCTGCTGG,n/a
human,284001,CCDC57,XR_001752489.2,TRCN0000166945,NM_198082.1-2156s1c1,GAAGATGTGTTGGATCCTTTA,pLKO.1,2064,3UTR,100,100,10.8,7.56,N,284001,CCDC57,CCGGGAAGATGTGTTGGATCCTTTACTCGAGTAAAGGATCCAACACATCTTCTTTTTG,AATTCAAAAAGAAGATGTGTTGGATCCTTTACTCGAGTAAAGGATCCAACACATCTTC,n/a
human,284001,CCDC57,XR_001752489.2,TRCN0000167622,NM_198082.1-1445s1c1,GATGCTCAAATTGCTCAACTA,pLKO.1,1353,3UTR,100,100,4.95,3.465,N,284001,CCDC57,CCGGGATGCTCAAATTGCTCAACTACTCGAGTAGTTGAGCAATTTGAGCATCTTTTTG,AATTCAAAAAGATGCTCAAATTGCTCAACTACTCGAGTAGTTGAGCAATTTGAGCATC,n/a
human,284001,CCDC57,XR_001752489.2,TRCN0000168788,NM_198082.1-1552s1c1,GCAGGACATTGAAAGGTACAA,pLKO.1,1460,3UTR,100,100,4.95,3.465,N,284001,CCDC57,CCGGGCAGGACATTGAAAGGTACAACTCGAGTTGTACCTTTCAATGTCCTGCTTTTTG,AATTCAAAAAGCAGGACATTGAAAGGTACAACTCGAGTTGTACCTTTCAATGTCCTGC,n/a
human,284001,CCDC57,XR_001752489.2,TRCN0000167776,NM_198082.1-1190s1c1,GAAACATTTAAGAGGAAGCAT,pLKO.1,1098,3UTR,100,100,3,2.1,N,284001,CCDC57,CCGGGAAACATTTAAGAGGAAGCATCTCGAGATGCTTCCTCTTAAATGTTTCTTTTTG,AATTCAAAAAGAAACATTTAAGAGGAAGCATCTCGAGATGCTTCCTCTTAAATGTTTC,n/a
human,284001,CCDC57,XR_001752489.2,TRCN0000106345,NM_030176.2-2044s1c1,GCAGCTAACCAGGAAGAAGTT,pLKO.1,1073,3UTR,90,100,4.95,3.465,N,78779,Spata2l,CCGGGCAGCTAACCAGGAAGAAGTTCTCGAGAACTTCTTCCTGGTTAGCTGCTTTTTG,AATTCAAAAAGCAGCTAACCAGGAAGAAGTTCTCGAGAACTTCTTCCTGGTTAGCTGC,n/a
human,284001,CCDC57,XR_001752489.2,TRCN0000239223,XM_001475034.1-193s21c1,GTAAAGGATTTAGTGGATAAG,pLKO_005,1041,3UTR,90,95,,,N,235858,Gm392,CCGGGTAAAGGATTTAGTGGATAAGCTCGAGCTTATCCACTAAATCCTTTACTTTTTG,AATTCAAAAAGTAAAGGATTTAGTGGATAAGCTCGAGCTTATCCACTAAATCCTTTAC,n/a
human,284001,CCDC57,XR_001752489.2,TRCN0000149440,NM_016079.1-475s1c1,GATCAGGAAGAAATGGAGGAA,pLKO.1,1874,3UTR,81,90,,,Y,51652,CHMP3,CCGGGATCAGGAAGAAATGGAGGAACTCGAGTTCCTCCATTTCTTCCTGATCTTTTTG,AATTCAAAAAGATCAGGAAGAAATGGAGGAACTCGAGTTCCTCCATTTCTTCCTGATC,n/a
human,284001,CCDC57,XR_001752489.2,TRCN0000297792,NM_016079.2-586s21c1,GATCAGGAAGAAATGGAGGAA,pLKO_005,1874,3UTR,81,90,,,Y,51652,CHMP3,CCGGGATCAGGAAGAAATGGAGGAACTCGAGTTCCTCCATTTCTTCCTGATCTTTTTG,AATTCAAAAAGATCAGGAAGAAATGGAGGAACTCGAGTTCCTCCATTTCTTCCTGATC,n/a
human,284001,CCDC57,XR_001752489.2,TRCN0000019166,NM_023931.2-684s1c1,CCAGAAACAAGGAAGAGGAAA,pLKO.1,1081,3UTR,90,89,,,Y,65988,ZNF747,CCGGCCAGAAACAAGGAAGAGGAAACTCGAGTTTCCTCTTCCTTGTTTCTGGTTTTTG,AATTCAAAAACCAGAAACAAGGAAGAGGAAACTCGAGTTTCCTCTTCCTTGTTTCTGG,n/a
human,284001,CCDC57,XR_001752489.2,TRCN0000245235,XM_909258.1-192s21c1,TGTAAAGGATTTAGTGGATAA,pLKO_005,1040,3UTR,90,89,,,Y,664876,Gm7385,CCGGTGTAAAGGATTTAGTGGATAACTCGAGTTATCCACTAAATCCTTTACATTTTTG,AATTCAAAAATGTAAAGGATTTAGTGGATAACTCGAGTTATCCACTAAATCCTTTACA,n/a
human,284001,CCDC57,XR_001752489.2,TRCN0000179103,NM_027745.1-1885s1c1,CCAGATTATGTTCTGACCCTT,pLKO.1,1989,3UTR,90,89,,,Y,71276,Ccdc57,CCGGCCAGATTATGTTCTGACCCTTCTCGAGAAGGGTCAGAACATAATCTGGTTTTTG,AATTCAAAAACCAGATTATGTTCTGACCCTTCTCGAGAAGGGTCAGAACATAATCTGG,n/a
human,284001,CCDC57,XR_001752489.2,TRCN0000061940,NM_012402.2-672s1c1,CAGGAGGAATTTGGCTACAAT,pLKO.1,423,3UTR,85,89,,,Y,23647,ARFIP2,CCGGCAGGAGGAATTTGGCTACAATCTCGAGATTGTAGCCAAATTCCTCCTGTTTTTG,AATTCAAAAACAGGAGGAATTTGGCTACAATCTCGAGATTGTAGCCAAATTCCTCCTG,n/a
human,284001,CCDC57,XR_001752489.2,TRCN0000300051,NM_012402.2-672s21c1,CAGGAGGAATTTGGCTACAAT,pLKO_005,423,3UTR,85,89,,,Y,23647,ARFIP2,CCGGCAGGAGGAATTTGGCTACAATCTCGAGATTGTAGCCAAATTCCTCCTGTTTTTG,AATTCAAAAACAGGAGGAATTTGGCTACAATCTCGAGATTGTAGCCAAATTCCTCCTG,n/a
human,284001,CCDC57,XR_001752489.2,TRCN0000153306,NM_006073.1-1040s1c1,GAGAAGGAAACTGCCATTGAT,pLKO.1,1293,3UTR,85,89,,,Y,10345,TRDN,CCGGGAGAAGGAAACTGCCATTGATCTCGAGATCAATGGCAGTTTCCTTCTCTTTTTG,AATTCAAAAAGAGAAGGAAACTGCCATTGATCTCGAGATCAATGGCAGTTTCCTTCTC,n/a
human,284001,CCDC57,XR_001752489.2,TRCN0000120555,NM_011619.1-821s1c1,GCAGCAGAAATACGAAATCAA,pLKO.1,2010,3UTR,85,89,,,Y,21956,Tnnt2,CCGGGCAGCAGAAATACGAAATCAACTCGAGTTGATTTCGTATTTCTGCTGCTTTTTG,AATTCAAAAAGCAGCAGAAATACGAAATCAACTCGAGTTGATTTCGTATTTCTGCTGC,n/a
human,284001,CCDC57,XR_001752489.2,TRCN0000350132,NM_011619.2-840s21c1,GCAGCAGAAATACGAAATCAA,pLKO_005,2010,3UTR,85,89,,,Y,21956,Tnnt2,CCGGGCAGCAGAAATACGAAATCAACTCGAGTTGATTTCGTATTTCTGCTGCTTTTTG,AATTCAAAAAGCAGCAGAAATACGAAATCAACTCGAGTTGATTTCGTATTTCTGCTGC,n/a
human,284001,CCDC57,XR_001752489.2,TRCN0000198173,NM_033072.1-720s1c1,CAGTGAAAGGTACAGAGCAAT,pLKO.1,1466,3UTR,85,89,,,Y,110962,Mbd6,CCGGCAGTGAAAGGTACAGAGCAATCTCGAGATTGCTCTGTACCTTTCACTGTTTTTG,AATTCAAAAACAGTGAAAGGTACAGAGCAATCTCGAGATTGCTCTGTACCTTTCACTG,n/a
human,284001,CCDC57,XR_001752489.2,TRCN0000080312,NM_029733.1-483s1c1,TCACAGGGATTTCTGGAGAAA,pLKO.1,48,3UTR,85,89,,,Y,76770,2010005H15Rik,CCGGTCACAGGGATTTCTGGAGAAACTCGAGTTTCTCCAGAAATCCCTGTGATTTTTG,AATTCAAAAATCACAGGGATTTCTGGAGAAACTCGAGTTTCTCCAGAAATCCCTGTGA,n/a
human,284001,CCDC57,XR_001752489.2,TRCN0000346957,NM_028843.1-298s21c1,CAATGCTGGTGGCGGTTAATA,pLKO_005,1153,3UTR,80,89,,,N,74267,Iqcf1,CCGGCAATGCTGGTGGCGGTTAATACTCGAGTATTAACCGCCACCAGCATTGTTTTTG,AATTCAAAAACAATGCTGGTGGCGGTTAATACTCGAGTATTAACCGCCACCAGCATTG,n/a
human,284001,CCDC57,XR_001752489.2,TRCN0000182022,NM_178915.2-2178s1c1,CCAAGAGAGGTCTTATGGAAT,pLKO.1,2545,3UTR,80,89,,,N,104885,Tmem179,CCGGCCAAGAGAGGTCTTATGGAATCTCGAGATTCCATAAGACCTCTCTTGGTTTTTG,AATTCAAAAACCAAGAGAGGTCTTATGGAATCTCGAGATTCCATAAGACCTCTCTTGG,n/a
human,284001,CCDC57,XR_001752489.2,TRCN0000234169,XM_483996.3-71s21c1,GACAGAGTGCGGCTCGTAATA,pLKO_005,2289,3UTR,80,89,,,Y,17847,Usp34,CCGGGACAGAGTGCGGCTCGTAATACTCGAGTATTACGAGCCGCACTCTGTCTTTTTG,AATTCAAAAAGACAGAGTGCGGCTCGTAATACTCGAGTATTACGAGCCGCACTCTGTC,n/a
human,284001,CCDC57,XR_001752489.2,TRCN0000106984,NM_021018.2-179s1c1,TGAGCTACTGATTCGCAAGCT,pLKO.1,296,3UTR,80,89,,,Y,8968,H3C7,CCGGTGAGCTACTGATTCGCAAGCTCTCGAGAGCTTGCGAATCAGTAGCTCATTTTTG,AATTCAAAAATGAGCTACTGATTCGCAAGCTCTCGAGAGCTTGCGAATCAGTAGCTCA,n/a
human,284001,CCDC57,XR_001752489.2,TRCN0000166963,NM_032625.1-954s1c1,GAAGCAGAAATGAGTAAAGTT,pLKO.1,1788,3UTR,80,89,,,Y,,,CCGGGAAGCAGAAATGAGTAAAGTTCTCGAGAACTTTACTCATTTCTGCTTCTTTTTG,AATTCAAAAAGAAGCAGAAATGAGTAAAGTTCTCGAGAACTTTACTCATTTCTGCTTC,n/a
human,284001,CCDC57,XR_001752489.2,TRCN0000137716,NM_174901.2-613s1c1,GATGAGGAAGGAGATGGAGAA,pLKO.1,1874,3UTR,80,89,,,Y,171484,FAM9C,CCGGGATGAGGAAGGAGATGGAGAACTCGAGTTCTCCATCTCCTTCCTCATCTTTTTG,AATTCAAAAAGATGAGGAAGGAGATGGAGAACTCGAGTTCTCCATCTCCTTCCTCATC,n/a
human,284001,CCDC57,XR_001752489.2,TRCN0000005789,NM_005076.2-2777s1c1,GCAGCAGGACATGAATGGTAT,pLKO.1,1457,3UTR,81,85,,,Y,6900,CNTN2,CCGGGCAGCAGGACATGAATGGTATCTCGAGATACCATTCATGTCCTGCTGCTTTTTG,AATTCAAAAAGCAGCAGGACATGAATGGTATCTCGAGATACCATTCATGTCCTGCTGC,n/a
human,284001,CCDC57,XR_001752489.2,TRCN0000143190,NM_014745.1-4742s1c1,GTACTTCGTGAAGTGCATCTA,pLKO.1,1314,3UTR,81,85,,,Y,9780,PIEZO1,CCGGGTACTTCGTGAAGTGCATCTACTCGAGTAGATGCACTTCACGAAGTACTTTTTG,AATTCAAAAAGTACTTCGTGAAGTGCATCTACTCGAGTAGATGCACTTCACGAAGTAC,n/a
human,284001,CCDC57,XR_001752489.2,TRCN0000118232,NM_173571.1-1131s1c1,AGCAGAGGTGAAGCCAAGAAA,pLKO.1,1421,3UTR,81,85,,,Y,255313,CT47A11,CCGGAGCAGAGGTGAAGCCAAGAAACTCGAGTTTCTTGGCTTCACCTCTGCTTTTTTG,AATTCAAAAAAGCAGAGGTGAAGCCAAGAAACTCGAGTTTCTTGGCTTCACCTCTGCT,n/a
human,284001,CCDC57,XR_001752489.2,TRCN0000156756,NM_182795.1-655s1c1,GAGGAAGAGGAAGAGGAAGAT,pLKO.1,1082,3UTR,77,85,,,Y,10361,NPM2,CCGGGAGGAAGAGGAAGAGGAAGATCTCGAGATCTTCCTCTTCCTCTTCCTCTTTTTG,AATTCAAAAAGAGGAAGAGGAAGAGGAAGATCTCGAGATCTTCCTCTTCCTCTTCCTC,n/a
