Taxon,"Gene ID","Gene Symbol",Transcript,"Clone ID","Legacy Clone Name","Target Seq",Vector,"Match Position","Match Region","Match %","SDR Match %","Intrinsic Score","Adjusted Score","Matches Other Gene in Same Taxon?","Orig. Target Gene ID","Orig. Target Gene Symbol","Forward Oligo Sequence","Reverse Oligo Sequence",Addgene
human,284001,CCDC57,XR_001752492.1,TRCN0000167936,NM_198082.1-962s1c1,CGGGAGCTTAAGGTTAAACTA,pLKO.1,882,3UTR,100,100,5.625,7.875,N,284001,CCDC57,CCGGCGGGAGCTTAAGGTTAAACTACTCGAGTAGTTTAACCTTAAGCTCCCGTTTTTG,AATTCAAAAACGGGAGCTTAAGGTTAAACTACTCGAGTAGTTTAACCTTAAGCTCCCG,n/a
human,284001,CCDC57,XR_001752492.1,TRCN0000167622,NM_198082.1-1445s1c1,GATGCTCAAATTGCTCAACTA,pLKO.1,1365,3UTR,100,100,4.95,3.465,N,284001,CCDC57,CCGGGATGCTCAAATTGCTCAACTACTCGAGTAGTTGAGCAATTTGAGCATCTTTTTG,AATTCAAAAAGATGCTCAAATTGCTCAACTACTCGAGTAGTTGAGCAATTTGAGCATC,n/a
human,284001,CCDC57,XR_001752492.1,TRCN0000167776,NM_198082.1-1190s1c1,GAAACATTTAAGAGGAAGCAT,pLKO.1,1110,3UTR,100,100,3,2.1,N,284001,CCDC57,CCGGGAAACATTTAAGAGGAAGCATCTCGAGATGCTTCCTCTTAAATGTTTCTTTTTG,AATTCAAAAAGAAACATTTAAGAGGAAGCATCTCGAGATGCTTCCTCTTAAATGTTTC,n/a
human,284001,CCDC57,XR_001752492.1,TRCN0000173053,NM_198082.1-1549s1c1,CCAGCAGGACATTGAAAGGTA,pLKO.1,1469,3UTR,95,100,3,4.2,N,284001,CCDC57,CCGGCCAGCAGGACATTGAAAGGTACTCGAGTACCTTTCAATGTCCTGCTGGTTTTTG,AATTCAAAAACCAGCAGGACATTGAAAGGTACTCGAGTACCTTTCAATGTCCTGCTGG,n/a
human,284001,CCDC57,XR_001752492.1,TRCN0000106345,NM_030176.2-2044s1c1,GCAGCTAACCAGGAAGAAGTT,pLKO.1,1085,3UTR,90,100,4.95,3.465,N,78779,Spata2l,CCGGGCAGCTAACCAGGAAGAAGTTCTCGAGAACTTCTTCCTGGTTAGCTGCTTTTTG,AATTCAAAAAGCAGCTAACCAGGAAGAAGTTCTCGAGAACTTCTTCCTGGTTAGCTGC,n/a
human,284001,CCDC57,XR_001752492.1,TRCN0000239223,XM_001475034.1-193s21c1,GTAAAGGATTTAGTGGATAAG,pLKO_005,1053,3UTR,90,95,,,N,235858,Gm392,CCGGGTAAAGGATTTAGTGGATAAGCTCGAGCTTATCCACTAAATCCTTTACTTTTTG,AATTCAAAAAGTAAAGGATTTAGTGGATAAGCTCGAGCTTATCCACTAAATCCTTTAC,n/a
human,284001,CCDC57,XR_001752492.1,TRCN0000019166,NM_023931.2-684s1c1,CCAGAAACAAGGAAGAGGAAA,pLKO.1,1093,3UTR,90,89,,,Y,65988,ZNF747,CCGGCCAGAAACAAGGAAGAGGAAACTCGAGTTTCCTCTTCCTTGTTTCTGGTTTTTG,AATTCAAAAACCAGAAACAAGGAAGAGGAAACTCGAGTTTCCTCTTCCTTGTTTCTGG,n/a
human,284001,CCDC57,XR_001752492.1,TRCN0000245235,XM_909258.1-192s21c1,TGTAAAGGATTTAGTGGATAA,pLKO_005,1052,3UTR,90,89,,,Y,664876,Gm7385,CCGGTGTAAAGGATTTAGTGGATAACTCGAGTTATCCACTAAATCCTTTACATTTTTG,AATTCAAAAATGTAAAGGATTTAGTGGATAACTCGAGTTATCCACTAAATCCTTTACA,n/a
human,284001,CCDC57,XR_001752492.1,TRCN0000061940,NM_012402.2-672s1c1,CAGGAGGAATTTGGCTACAAT,pLKO.1,435,3UTR,85,89,,,Y,23647,ARFIP2,CCGGCAGGAGGAATTTGGCTACAATCTCGAGATTGTAGCCAAATTCCTCCTGTTTTTG,AATTCAAAAACAGGAGGAATTTGGCTACAATCTCGAGATTGTAGCCAAATTCCTCCTG,n/a
human,284001,CCDC57,XR_001752492.1,TRCN0000300051,NM_012402.2-672s21c1,CAGGAGGAATTTGGCTACAAT,pLKO_005,435,3UTR,85,89,,,Y,23647,ARFIP2,CCGGCAGGAGGAATTTGGCTACAATCTCGAGATTGTAGCCAAATTCCTCCTGTTTTTG,AATTCAAAAACAGGAGGAATTTGGCTACAATCTCGAGATTGTAGCCAAATTCCTCCTG,n/a
human,284001,CCDC57,XR_001752492.1,TRCN0000153306,NM_006073.1-1040s1c1,GAGAAGGAAACTGCCATTGAT,pLKO.1,1305,3UTR,85,89,,,Y,10345,TRDN,CCGGGAGAAGGAAACTGCCATTGATCTCGAGATCAATGGCAGTTTCCTTCTCTTTTTG,AATTCAAAAAGAGAAGGAAACTGCCATTGATCTCGAGATCAATGGCAGTTTCCTTCTC,n/a
human,284001,CCDC57,XR_001752492.1,TRCN0000141702,NM_139170.2-1063s1c1,CAGGAGAGAAGGAAGATGATA,pLKO.1,1094,3UTR,85,89,,,Y,146562,C16orf71,CCGGCAGGAGAGAAGGAAGATGATACTCGAGTATCATCTTCCTTCTCTCCTGTTTTTG,AATTCAAAAACAGGAGAGAAGGAAGATGATACTCGAGTATCATCTTCCTTCTCTCCTG,n/a
human,284001,CCDC57,XR_001752492.1,TRCN0000080312,NM_029733.1-483s1c1,TCACAGGGATTTCTGGAGAAA,pLKO.1,60,3UTR,85,89,,,Y,76770,2010005H15Rik,CCGGTCACAGGGATTTCTGGAGAAACTCGAGTTTCTCCAGAAATCCCTGTGATTTTTG,AATTCAAAAATCACAGGGATTTCTGGAGAAACTCGAGTTTCTCCAGAAATCCCTGTGA,n/a
human,284001,CCDC57,XR_001752492.1,TRCN0000346957,NM_028843.1-298s21c1,CAATGCTGGTGGCGGTTAATA,pLKO_005,1165,3UTR,80,89,,,N,74267,Iqcf1,CCGGCAATGCTGGTGGCGGTTAATACTCGAGTATTAACCGCCACCAGCATTGTTTTTG,AATTCAAAAACAATGCTGGTGGCGGTTAATACTCGAGTATTAACCGCCACCAGCATTG,n/a
human,284001,CCDC57,XR_001752492.1,TRCN0000168788,NM_198082.1-1552s1c1,GCAGGACATTGAAAGGTACAA,pLKO.1,1472,3UTR,80,89,,,N,284001,CCDC57,CCGGGCAGGACATTGAAAGGTACAACTCGAGTTGTACCTTTCAATGTCCTGCTTTTTG,AATTCAAAAAGCAGGACATTGAAAGGTACAACTCGAGTTGTACCTTTCAATGTCCTGC,n/a
human,284001,CCDC57,XR_001752492.1,TRCN0000438077,NM_029601.2-317s21c1,AGGAAGACTTTGTGCTACAGG,pLKO_005,436,3UTR,80,89,,,Y,76411,Ift43,CCGGAGGAAGACTTTGTGCTACAGGCTCGAGCCTGTAGCACAAAGTCTTCCTTTTTTG,AATTCAAAAAAGGAAGACTTTGTGCTACAGGCTCGAGCCTGTAGCACAAAGTCTTCCT,n/a
human,284001,CCDC57,XR_001752492.1,TRCN0000106984,NM_021018.2-179s1c1,TGAGCTACTGATTCGCAAGCT,pLKO.1,308,3UTR,80,89,,,Y,8968,H3C7,CCGGTGAGCTACTGATTCGCAAGCTCTCGAGAGCTTGCGAATCAGTAGCTCATTTTTG,AATTCAAAAATGAGCTACTGATTCGCAAGCTCTCGAGAGCTTGCGAATCAGTAGCTCA,n/a
human,284001,CCDC57,XR_001752492.1,TRCN0000166963,NM_032625.1-954s1c1,GAAGCAGAAATGAGTAAAGTT,pLKO.1,1637,3UTR,80,89,,,Y,,,CCGGGAAGCAGAAATGAGTAAAGTTCTCGAGAACTTTACTCATTTCTGCTTCTTTTTG,AATTCAAAAAGAAGCAGAAATGAGTAAAGTTCTCGAGAACTTTACTCATTTCTGCTTC,n/a
human,284001,CCDC57,XR_001752492.1,TRCN0000049207,XM_372916.1-122s1c1,CTGGAGAGAAAGGACTTGATT,pLKO.1,741,3UTR,80,89,,,Y,391352,LOC391352,CCGGCTGGAGAGAAAGGACTTGATTCTCGAGAATCAAGTCCTTTCTCTCCAGTTTTTG,AATTCAAAAACTGGAGAGAAAGGACTTGATTCTCGAGAATCAAGTCCTTTCTCTCCAG,n/a
human,284001,CCDC57,XR_001752492.1,TRCN0000191752,NM_009049.1-428s1c1,GAGGAGAAACTTCAACTCTTA,pLKO.1,1065,3UTR,80,89,,,Y,19711,Resp18,CCGGGAGGAGAAACTTCAACTCTTACTCGAGTAAGAGTTGAAGTTTCTCCTCTTTTTG,AATTCAAAAAGAGGAGAAACTTCAACTCTTACTCGAGTAAGAGTTGAAGTTTCTCCTC,n/a
human,284001,CCDC57,XR_001752492.1,TRCN0000044711,NM_018018.2-470s1c1,GCAGCAATGAGCAGTCAATTT,pLKO.1,174,3UTR,81,85,,,Y,55089,SLC38A4,CCGGGCAGCAATGAGCAGTCAATTTCTCGAGAAATTGACTGCTCATTGCTGCTTTTTG,AATTCAAAAAGCAGCAATGAGCAGTCAATTTCTCGAGAAATTGACTGCTCATTGCTGC,n/a
human,284001,CCDC57,XR_001752492.1,TRCN0000143190,NM_014745.1-4742s1c1,GTACTTCGTGAAGTGCATCTA,pLKO.1,1326,3UTR,81,85,,,Y,9780,PIEZO1,CCGGGTACTTCGTGAAGTGCATCTACTCGAGTAGATGCACTTCACGAAGTACTTTTTG,AATTCAAAAAGTACTTCGTGAAGTGCATCTACTCGAGTAGATGCACTTCACGAAGTAC,n/a
human,284001,CCDC57,XR_001752492.1,TRCN0000118232,NM_173571.1-1131s1c1,AGCAGAGGTGAAGCCAAGAAA,pLKO.1,1433,3UTR,81,85,,,Y,255313,CT47A11,CCGGAGCAGAGGTGAAGCCAAGAAACTCGAGTTTCTTGGCTTCACCTCTGCTTTTTTG,AATTCAAAAAAGCAGAGGTGAAGCCAAGAAACTCGAGTTTCTTGGCTTCACCTCTGCT,n/a
human,284001,CCDC57,XR_001752492.1,TRCN0000005789,NM_005076.2-2777s1c1,GCAGCAGGACATGAATGGTAT,pLKO.1,1469,3UTR,77,85,,,Y,6900,CNTN2,CCGGGCAGCAGGACATGAATGGTATCTCGAGATACCATTCATGTCCTGCTGCTTTTTG,AATTCAAAAAGCAGCAGGACATGAATGGTATCTCGAGATACCATTCATGTCCTGCTGC,n/a
human,284001,CCDC57,XR_001752492.1,TRCN0000063752,NM_018941.2-1074s1c1,GCTGCGGAAGAAGAGGCCATA,pLKO.1,1424,3UTR,77,85,,,Y,2055,CLN8,CCGGGCTGCGGAAGAAGAGGCCATACTCGAGTATGGCCTCTTCTTCCGCAGCTTTTTG,AATTCAAAAAGCTGCGGAAGAAGAGGCCATACTCGAGTATGGCCTCTTCTTCCGCAGC,n/a
human,284001,CCDC57,XR_001752492.1,TRCN0000156756,NM_182795.1-655s1c1,GAGGAAGAGGAAGAGGAAGAT,pLKO.1,1094,3UTR,77,85,,,Y,10361,NPM2,CCGGGAGGAAGAGGAAGAGGAAGATCTCGAGATCTTCCTCTTCCTCTTCCTCTTTTTG,AATTCAAAAAGAGGAAGAGGAAGAGGAAGATCTCGAGATCTTCCTCTTCCTCTTCCTC,n/a
