Taxon,"Gene ID","Gene Symbol",Transcript,"Clone ID","Legacy Clone Name","Target Seq",Vector,"Match Position","Match Region","Match %","SDR Match %","Intrinsic Score","Adjusted Score","Matches Other Gene in Same Taxon?","Orig. Target Gene ID","Orig. Target Gene Symbol","Forward Oligo Sequence","Reverse Oligo Sequence",Addgene
human,100996709,LOC100996709,XR_001756189.1,TRCN0000344420,NM_001039083.3-265s21c1,GTGTGGAGACAGTAGAATATA,pLKO_005,372,3UTR,100,100,15,7.5,Y,100506084,ARL17B,CCGGGTGTGGAGACAGTAGAATATACTCGAGTATATTCTACTGTCTCCACACTTTTTG,AATTCAAAAAGTGTGGAGACAGTAGAATATACTCGAGTATATTCTACTGTCTCCACAC,n/a
human,100996709,LOC100996709,XR_001756189.1,TRCN0000344481,NM_001039083.3-582s21c1,AGCAGCGGTTTCCCAAGTTTC,pLKO_005,689,3UTR,100,100,10.8,5.4,Y,100506084,ARL17B,CCGGAGCAGCGGTTTCCCAAGTTTCCTCGAGGAAACTTGGGAAACCGCTGCTTTTTTG,AATTCAAAAAAGCAGCGGTTTCCCAAGTTTCCTCGAGGAAACTTGGGAAACCGCTGCT,n/a
human,100996709,LOC100996709,XR_001756189.1,TRCN0000353088,NM_001039083.3-332s21c1,CAGACCTCTGTGGCAGCATTT,pLKO_005,439,3UTR,100,100,10.8,5.4,Y,100506084,ARL17B,CCGGCAGACCTCTGTGGCAGCATTTCTCGAGAAATGCTGCCACAGAGGTCTGTTTTTG,AATTCAAAAACAGACCTCTGTGGCAGCATTTCTCGAGAAATGCTGCCACAGAGGTCTG,n/a
human,100996709,LOC100996709,XR_001756189.1,TRCN0000263038,NM_001039083.3-165s21c1,CGGATTCTTATATTGAGTTTG,pLKO_005,272,3UTR,100,100,10.8,5.4,Y,100506084,ARL17B,CCGGCGGATTCTTATATTGAGTTTGCTCGAGCAAACTCAATATAAGAATCCGTTTTTG,AATTCAAAAACGGATTCTTATATTGAGTTTGCTCGAGCAAACTCAATATAAGAATCCG,n/a
human,100996709,LOC100996709,XR_001756189.1,TRCN0000140294,NM_016632.1-286s1c1,GATGTTGGCAGCCACTTCAAA,pLKO.1,416,3UTR,100,100,5.625,2.8125,Y,51326,ARL17A,CCGGGATGTTGGCAGCCACTTCAAACTCGAGTTTGAAGTGGCTGCCAACATCTTTTTG,AATTCAAAAAGATGTTGGCAGCCACTTCAAACTCGAGTTTGAAGTGGCTGCCAACATC,n/a
human,100996709,LOC100996709,XR_001756189.1,TRCN0000371106,NM_001039083.3-451s21c1,GAATGTGGAAAGGAGGTAGAA,pLKO_005,558,3UTR,100,100,4.95,2.475,Y,100506084,ARL17B,CCGGGAATGTGGAAAGGAGGTAGAACTCGAGTTCTACCTCCTTTCCACATTCTTTTTG,AATTCAAAAAGAATGTGGAAAGGAGGTAGAACTCGAGTTCTACCTCCTTTCCACATTC,n/a
human,100996709,LOC100996709,XR_001756189.1,TRCN0000141827,NM_016632.1-156s1c1,GAGTTTGGATACAGCTGGAAA,pLKO.1,286,3UTR,100,100,4.95,2.475,Y,51326,ARL17A,CCGGGAGTTTGGATACAGCTGGAAACTCGAGTTTCCAGCTGTATCCAAACTCTTTTTG,AATTCAAAAAGAGTTTGGATACAGCTGGAAACTCGAGTTTCCAGCTGTATCCAAACTC,n/a
human,100996709,LOC100996709,XR_001756189.1,TRCN0000371107,NM_001039083.3-242s21c1,TGCCGTCCCTACAGTAGGTTT,pLKO_005,349,3UTR,100,100,4.95,2.475,Y,100506084,ARL17B,CCGGTGCCGTCCCTACAGTAGGTTTCTCGAGAAACCTACTGTAGGGACGGCATTTTTG,AATTCAAAAATGCCGTCCCTACAGTAGGTTTCTCGAGAAACCTACTGTAGGGACGGCA,n/a
human,100996709,LOC100996709,XR_001756189.1,TRCN0000263039,NM_001039083.3-515s21c1,TGGTCAGCTGGACTCCATACT,pLKO_005,622,3UTR,100,100,4.95,2.475,Y,100506084,ARL17B,CCGGTGGTCAGCTGGACTCCATACTCTCGAGAGTATGGAGTCCAGCTGACCATTTTTG,AATTCAAAAATGGTCAGCTGGACTCCATACTCTCGAGAGTATGGAGTCCAGCTGACCA,n/a
human,100996709,LOC100996709,XR_001756189.1,TRCN0000140324,NM_016632.1-230s1c1,CAGTAGGTTTCTGTGTGGAGA,pLKO.1,360,3UTR,100,100,2.64,1.32,Y,51326,ARL17A,CCGGCAGTAGGTTTCTGTGTGGAGACTCGAGTCTCCACACAGAAACCTACTGTTTTTG,AATTCAAAAACAGTAGGTTTCTGTGTGGAGACTCGAGTCTCCACACAGAAACCTACTG,n/a
human,100996709,LOC100996709,XR_001756189.1,TRCN0000139147,NM_016632.1-447s1c1,CCCATCTCTTGGACAGATGAT,pLKO.1,946,3UTR,100,100,.495,.2475,Y,51326,ARL17A,CCGGCCCATCTCTTGGACAGATGATCTCGAGATCATCTGTCCAAGAGATGGGTTTTTG,AATTCAAAAACCCATCTCTTGGACAGATGATCTCGAGATCATCTGTCCAAGAGATGGG,n/a
human,100996709,LOC100996709,XR_001756189.1,TRCN0000166030,NM_005821.2-472s1c1,CCTCTGGAAATCAGCTGTGTT,pLKO.1,724,3UTR,95,100,4.95,2.475,Y,10230,NBR2,CCGGCCTCTGGAAATCAGCTGTGTTCTCGAGAACACAGCTGATTTCCAGAGGTTTTTG,AATTCAAAAACCTCTGGAAATCAGCTGTGTTCTCGAGAACACAGCTGATTTCCAGAGG,n/a
human,100996709,LOC100996709,XR_001756189.1,TRCN0000202132,NM_177904.2-639s1c1,CCCAGCAAGACACATCAAGAA,pLKO.1,487,3UTR,81,90,,,Y,330837,6030452D12Rik,CCGGCCCAGCAAGACACATCAAGAACTCGAGTTCTTGATGTGTCTTGCTGGGTTTTTG,AATTCAAAAACCCAGCAAGACACATCAAGAACTCGAGTTCTTGATGTGTCTTGCTGGG,n/a
human,100996709,LOC100996709,XR_001756189.1,TRCN0000100228,NM_007477.2-685s1c1,GTGGAGACAGTAGAGTACAAA,pLKO.1,374,3UTR,90,89,,,Y,11841,Arf2,CCGGGTGGAGACAGTAGAGTACAAACTCGAGTTTGTACTCTACTGTCTCCACTTTTTG,AATTCAAAAAGTGGAGACAGTAGAGTACAAACTCGAGTTTGTACTCTACTGTCTCCAC,n/a
human,100996709,LOC100996709,XR_001756189.1,TRCN0000107211,NM_012454.2-3499s1c1,CCACTTCAGAATGAGACCTTT,pLKO.1,427,3UTR,85,89,,,Y,26230,TIAM2,CCGGCCACTTCAGAATGAGACCTTTCTCGAGAAAGGTCTCATTCTGAAGTGGTTTTTG,AATTCAAAAACCACTTCAGAATGAGACCTTTCTCGAGAAAGGTCTCATTCTGAAGTGG,n/a
human,100996709,LOC100996709,XR_001756189.1,TRCN0000148866,NM_152614.1-665s1c1,CTGAAGCTGAAGCTTTACCAT,pLKO.1,1121,3UTR,85,89,,,Y,165100,TEX44,CCGGCTGAAGCTGAAGCTTTACCATCTCGAGATGGTAAAGCTTCAGCTTCAGTTTTTG,AATTCAAAAACTGAAGCTGAAGCTTTACCATCTCGAGATGGTAAAGCTTCAGCTTCAG,n/a
human,100996709,LOC100996709,XR_001756189.1,TRCN0000032022,NM_138666.2-3450s1c1,CCTGTACTACAAGAAGGATAA,pLKO.1,1413,3UTR,80,89,,,Y,192167,Nlgn1,CCGGCCTGTACTACAAGAAGGATAACTCGAGTTATCCTTCTTGTAGTACAGGTTTTTG,AATTCAAAAACCTGTACTACAAGAAGGATAACTCGAGTTATCCTTCTTGTAGTACAGG,n/a
human,100996709,LOC100996709,XR_001756189.1,TRCN0000221015,NM_173084.1-811s1c2,GCTCTCTGTGATGTTGGCAAT,pLKO.1,407,3UTR,80,89,,,Y,286827,TRIM59,CCGGGCTCTCTGTGATGTTGGCAATCTCGAGATTGCCAACATCACAGAGAGCTTTTTG,AATTCAAAAAGCTCTCTGTGATGTTGGCAATCTCGAGATTGCCAACATCACAGAGAGC,n/a
human,100996709,LOC100996709,XR_001756189.1,TRCN0000025549,XM_356581.1-357s1c1,GCTGCATGAATCTGTAGAAAT,pLKO.1,1190,3UTR,81,85,,,Y,382587,LOC382587,CCGGGCTGCATGAATCTGTAGAAATCTCGAGATTTCTACAGATTCATGCAGCTTTTTG,AATTCAAAAAGCTGCATGAATCTGTAGAAATCTCGAGATTTCTACAGATTCATGCAGC,n/a
human,100996709,LOC100996709,XR_001756189.1,TRCN0000263551,NM_145270.1-336s21c1,GAAGCCCAAGAAGCCACACTA,pLKO_005,483,3UTR,81,85,,,Y,146325,PRR35,CCGGGAAGCCCAAGAAGCCACACTACTCGAGTAGTGTGGCTTCTTGGGCTTCTTTTTG,AATTCAAAAAGAAGCCCAAGAAGCCACACTACTCGAGTAGTGTGGCTTCTTGGGCTTC,n/a
human,100996709,LOC100996709,XR_001756189.1,TRCN0000583869,,CATCTGACTGTGGTCATAATA,pLKO_005,1504,3UTR,81,85,,,Y,392376,OR13C2,CCGGCATCTGACTGTGGTCATAATACTCGAGTATTATGACCACAGTCAGATGTTTTTG,AATTCAAAAACATCTGACTGTGGTCATAATACTCGAGTATTATGACCACAGTCAGATG,n/a
human,100996709,LOC100996709,XR_001756189.1,TRCN0000180932,NM_152771.1-651s1c1,GATTATGCAAACGGAGGCAAG,pLKO.1,1109,3UTR,77,85,,,Y,255193,CSNK1G2-AS1,CCGGGATTATGCAAACGGAGGCAAGCTCGAGCTTGCCTCCGTTTGCATAATCTTTTTG,AATTCAAAAAGATTATGCAAACGGAGGCAAGCTCGAGCTTGCCTCCGTTTGCATAATC,n/a
human,100996709,LOC100996709,XR_001756189.1,TRCN0000168721,NM_153235.2-621s1c1,GCTGAATTGCTGGATGAACAT,pLKO.1,1451,3UTR,77,85,,,Y,167838,TXLNB,CCGGGCTGAATTGCTGGATGAACATCTCGAGATGTTCATCCAGCAATTCAGCTTTTTG,AATTCAAAAAGCTGAATTGCTGGATGAACATCTCGAGATGTTCATCCAGCAATTCAGC,n/a
human,100996709,LOC100996709,XR_001756189.1,TRCN0000032790,XM_125854.2-692s1c1,GCTGAAGGAACTCAGCAGAAA,pLKO.1,675,3UTR,77,85,,,Y,71761,Amdhd1,CCGGGCTGAAGGAACTCAGCAGAAACTCGAGTTTCTGCTGAGTTCCTTCAGCTTTTTG,AATTCAAAAAGCTGAAGGAACTCAGCAGAAACTCGAGTTTCTGCTGAGTTCCTTCAGC,n/a
