Taxon,"Gene ID","Gene Symbol",Transcript,"Clone ID","Legacy Clone Name","Target Seq",Vector,"Match Position","Match Region","Match %","SDR Match %","Intrinsic Score","Adjusted Score","Matches Other Gene in Same Taxon?","Orig. Target Gene ID","Orig. Target Gene Symbol","Forward Oligo Sequence","Reverse Oligo Sequence",Addgene
human,105369225,LOC105369225,XR_001756625.2,TRCN0000344481,NM_001039083.3-582s21c1,AGCAGCGGTTTCCCAAGTTTC,pLKO_005,579,3UTR,100,100,10.8,5.4,Y,100506084,ARL17B,CCGGAGCAGCGGTTTCCCAAGTTTCCTCGAGGAAACTTGGGAAACCGCTGCTTTTTTG,AATTCAAAAAAGCAGCGGTTTCCCAAGTTTCCTCGAGGAAACTTGGGAAACCGCTGCT,n/a
human,105369225,LOC105369225,XR_001756625.2,TRCN0000371106,NM_001039083.3-451s21c1,GAATGTGGAAAGGAGGTAGAA,pLKO_005,448,3UTR,100,100,4.95,2.475,Y,100506084,ARL17B,CCGGGAATGTGGAAAGGAGGTAGAACTCGAGTTCTACCTCCTTTCCACATTCTTTTTG,AATTCAAAAAGAATGTGGAAAGGAGGTAGAACTCGAGTTCTACCTCCTTTCCACATTC,n/a
human,105369225,LOC105369225,XR_001756625.2,TRCN0000263039,NM_001039083.3-515s21c1,TGGTCAGCTGGACTCCATACT,pLKO_005,512,3UTR,100,100,4.95,2.475,Y,100506084,ARL17B,CCGGTGGTCAGCTGGACTCCATACTCTCGAGAGTATGGAGTCCAGCTGACCATTTTTG,AATTCAAAAATGGTCAGCTGGACTCCATACTCTCGAGAGTATGGAGTCCAGCTGACCA,n/a
human,105369225,LOC105369225,XR_001756625.2,TRCN0000139147,NM_016632.1-447s1c1,CCCATCTCTTGGACAGATGAT,pLKO.1,836,3UTR,100,100,.495,.2475,Y,51326,ARL17A,CCGGCCCATCTCTTGGACAGATGATCTCGAGATCATCTGTCCAAGAGATGGGTTTTTG,AATTCAAAAACCCATCTCTTGGACAGATGATCTCGAGATCATCTGTCCAAGAGATGGG,n/a
human,105369225,LOC105369225,XR_001756625.2,TRCN0000166030,NM_005821.2-472s1c1,CCTCTGGAAATCAGCTGTGTT,pLKO.1,614,3UTR,95,100,4.95,2.475,Y,10230,NBR2,CCGGCCTCTGGAAATCAGCTGTGTTCTCGAGAACACAGCTGATTTCCAGAGGTTTTTG,AATTCAAAAACCTCTGGAAATCAGCTGTGTTCTCGAGAACACAGCTGATTTCCAGAGG,n/a
human,105369225,LOC105369225,XR_001756625.2,TRCN0000202132,NM_177904.2-639s1c1,CCCAGCAAGACACATCAAGAA,pLKO.1,377,3UTR,81,90,,,Y,330837,6030452D12Rik,CCGGCCCAGCAAGACACATCAAGAACTCGAGTTCTTGATGTGTCTTGCTGGGTTTTTG,AATTCAAAAACCCAGCAAGACACATCAAGAACTCGAGTTCTTGATGTGTCTTGCTGGG,n/a
human,105369225,LOC105369225,XR_001756625.2,TRCN0000296424,NM_012139.2-742s21c1,CAGACCACTCAGCTTCATTAA,pLKO_005,28,3UTR,81,90,,,Y,26297,SERGEF,CCGGCAGACCACTCAGCTTCATTAACTCGAGTTAATGAAGCTGAGTGGTCTGTTTTTG,AATTCAAAAACAGACCACTCAGCTTCATTAACTCGAGTTAATGAAGCTGAGTGGTCTG,n/a
human,105369225,LOC105369225,XR_001756625.2,TRCN0000428035,NM_026620.3-390s21c1,AGTACAGAACTTCAAGCTTTA,pLKO_005,937,3UTR,85,89,,,Y,68215,Fam98b,CCGGAGTACAGAACTTCAAGCTTTACTCGAGTAAAGCTTGAAGTTCTGTACTTTTTTG,AATTCAAAAAAGTACAGAACTTCAAGCTTTACTCGAGTAAAGCTTGAAGTTCTGTACT,n/a
human,105369225,LOC105369225,XR_001756625.2,TRCN0000190111,NM_001009952.1-159s1c1,CTCCAGGCATTCAATGCTACT,pLKO.1,1101,3UTR,80,89,,,Y,494519,Scgb2b20,CCGGCTCCAGGCATTCAATGCTACTCTCGAGAGTAGCATTGAATGCCTGGAGTTTTTG,AATTCAAAAACTCCAGGCATTCAATGCTACTCTCGAGAGTAGCATTGAATGCCTGGAG,n/a
human,105369225,LOC105369225,XR_001756625.2,TRCN0000263551,NM_145270.1-336s21c1,GAAGCCCAAGAAGCCACACTA,pLKO_005,373,3UTR,81,85,,,Y,146325,PRR35,CCGGGAAGCCCAAGAAGCCACACTACTCGAGTAGTGTGGCTTCTTGGGCTTCTTTTTG,AATTCAAAAAGAAGCCCAAGAAGCCACACTACTCGAGTAGTGTGGCTTCTTGGGCTTC,n/a
human,105369225,LOC105369225,XR_001756625.2,TRCN0000024808,NM_138650.1-80s1c1,CTCCAGAAATACTCTGAATAT,pLKO.1,60,3UTR,77,85,,,Y,110197,Dgkg,CCGGCTCCAGAAATACTCTGAATATCTCGAGATATTCAGAGTATTTCTGGAGTTTTTG,AATTCAAAAACTCCAGAAATACTCTGAATATCTCGAGATATTCAGAGTATTTCTGGAG,n/a
