Taxon,"Gene ID","Gene Symbol",Transcript,"Clone ID","Legacy Clone Name","Target Seq",Vector,"Match Position","Match Region","Match %","SDR Match %","Intrinsic Score","Adjusted Score","Matches Other Gene in Same Taxon?","Orig. Target Gene ID","Orig. Target Gene Symbol","Forward Oligo Sequence","Reverse Oligo Sequence",Addgene
human,728621,CCDC30,XR_002957535.1,TRCN0000129971,NM_025030.1-123s1c1,GAAGGAGAAGGAACAATGTAA,pLKO.1,816,3UTR,100,100,5.625,3.9375,N,728621,CCDC30,CCGGGAAGGAGAAGGAACAATGTAACTCGAGTTACATTGTTCCTTCTCCTTCTTTTTG,AATTCAAAAAGAAGGAGAAGGAACAATGTAACTCGAGTTACATTGTTCCTTCTCCTTC,n/a
human,728621,CCDC30,XR_002957535.1,TRCN0000128544,NM_025030.1-232s1c1,CTACAGAAAGCAAAGGAACAA,pLKO.1,925,3UTR,100,100,4.95,3.465,N,728621,CCDC30,CCGGCTACAGAAAGCAAAGGAACAACTCGAGTTGTTCCTTTGCTTTCTGTAGTTTTTG,AATTCAAAAACTACAGAAAGCAAAGGAACAACTCGAGTTGTTCCTTTGCTTTCTGTAG,n/a
human,728621,CCDC30,XR_002957535.1,TRCN0000130553,NM_025030.1-91s1c1,GAGATTCAAAGGCTCACTGAT,pLKO.1,784,3UTR,100,100,4.95,3.465,N,728621,CCDC30,CCGGGAGATTCAAAGGCTCACTGATCTCGAGATCAGTGAGCCTTTGAATCTCTTTTTG,AATTCAAAAAGAGATTCAAAGGCTCACTGATCTCGAGATCAGTGAGCCTTTGAATCTC,n/a
human,728621,CCDC30,XR_002957535.1,TRCN0000128465,NM_025030.1-265s1c1,GATGAGGAAATTCTGGCTTTA,pLKO.1,958,3UTR,100,100,10.8,6.48,N,728621,CCDC30,CCGGGATGAGGAAATTCTGGCTTTACTCGAGTAAAGCCAGAATTTCCTCATCTTTTTG,AATTCAAAAAGATGAGGAAATTCTGGCTTTACTCGAGTAAAGCCAGAATTTCCTCATC,n/a
human,728621,CCDC30,XR_002957535.1,TRCN0000282214,NM_001008388.3-344s21c1,TCCGAAAGTAGTGAATGAAAT,pLKO_005,2676,3UTR,95,95,,,Y,493856,CISD2,CCGGTCCGAAAGTAGTGAATGAAATCTCGAGATTTCATTCACTACTTTCGGATTTTTG,AATTCAAAAATCCGAAAGTAGTGAATGAAATCTCGAGATTTCATTCACTACTTTCGGA,n/a
human,728621,CCDC30,XR_002957535.1,TRCN0000140610,NM_025042.2-931s1c1,GCCTCTCAGGTTCAAGCAATT,pLKO.1,2015,3UTR,95,95,,,Y,,,CCGGGCCTCTCAGGTTCAAGCAATTCTCGAGAATTGCTTGAACCTGAGAGGCTTTTTG,AATTCAAAAAGCCTCTCAGGTTCAAGCAATTCTCGAGAATTGCTTGAACCTGAGAGGC,n/a
human,728621,CCDC30,XR_002957535.1,TRCN0000204533,NM_001013675.1-1987s1c1,CCTCCCAAAGTGCTGGAATTA,pLKO.1,664,3UTR,95,95,,,Y,400891,LRRC74B,CCGGCCTCCCAAAGTGCTGGAATTACTCGAGTAATTCCAGCACTTTGGGAGGTTTTTG,AATTCAAAAACCTCCCAAAGTGCTGGAATTACTCGAGTAATTCCAGCACTTTGGGAGG,n/a
human,728621,CCDC30,XR_002957535.1,TRCN0000268126,NM_029286.1-1628s21c1,TTGTCAGAGAAACTATCTAAC,pLKO_005,1858,3UTR,90,95,,,N,73332,Ccdc30,CCGGTTGTCAGAGAAACTATCTAACCTCGAGGTTAGATAGTTTCTCTGACAATTTTTG,AATTCAAAAATTGTCAGAGAAACTATCTAACCTCGAGGTTAGATAGTTTCTCTGACAA,n/a
human,728621,CCDC30,XR_002957535.1,TRCN0000073064,NM_020870.1-3213s1c1,GCAGAACTTGAACTTAAAGAA,pLKO.1,1254,3UTR,90,95,,,Y,57630,SH3RF1,CCGGGCAGAACTTGAACTTAAAGAACTCGAGTTCTTTAAGTTCAAGTTCTGCTTTTTG,AATTCAAAAAGCAGAACTTGAACTTAAAGAACTCGAGTTCTTTAAGTTCAAGTTCTGC,n/a
human,728621,CCDC30,XR_002957535.1,TRCN0000199172,NM_002759.1-2425s1c1,CCTCCTGAGTAGCTGGATTAC,pLKO.1,2048,3UTR,85,95,,,Y,5610,EIF2AK2,CCGGCCTCCTGAGTAGCTGGATTACCTCGAGGTAATCCAGCTACTCAGGAGGTTTTTG,AATTCAAAAACCTCCTGAGTAGCTGGATTACCTCGAGGTAATCCAGCTACTCAGGAGG,n/a
human,728621,CCDC30,XR_002957535.1,TRCN0000276074,NM_003487.2-461s21c1,ATATGATGAGCAGTCAAATTA,pLKO_005,1827,3UTR,81,90,,,Y,8148,TAF15,CCGGATATGATGAGCAGTCAAATTACTCGAGTAATTTGACTGCTCATCATATTTTTTG,AATTCAAAAAATATGATGAGCAGTCAAATTACTCGAGTAATTTGACTGCTCATCATAT,n/a
human,728621,CCDC30,XR_002957535.1,TRCN0000159986,NM_198584.1-2669s1c1,CCTCTCAAATTGCTGGAATTA,pLKO.1,664,3UTR,90,89,,,Y,377677,CA13,CCGGCCTCTCAAATTGCTGGAATTACTCGAGTAATTCCAGCAATTTGAGAGGTTTTTG,AATTCAAAAACCTCTCAAATTGCTGGAATTACTCGAGTAATTCCAGCAATTTGAGAGG,n/a
human,728621,CCDC30,XR_002957535.1,TRCN0000116737,NM_016369.3-2405s1c1,CCTCCCAAGTAGCTGGAATTA,pLKO.1,2048,3UTR,90,89,,,Y,51208,CLDN18,CCGGCCTCCCAAGTAGCTGGAATTACTCGAGTAATTCCAGCTACTTGGGAGGTTTTTG,AATTCAAAAACCTCCCAAGTAGCTGGAATTACTCGAGTAATTCCAGCTACTTGGGAGG,n/a
human,728621,CCDC30,XR_002957535.1,TRCN0000165774,NM_001012391.1-946s1c1,CCTCCTAAGTAGCTGGGATTA,pLKO.1,2048,3UTR,90,89,,,Y,100652781,SNX29P1,CCGGCCTCCTAAGTAGCTGGGATTACTCGAGTAATCCCAGCTACTTAGGAGGTTTTTG,AATTCAAAAACCTCCTAAGTAGCTGGGATTACTCGAGTAATCCCAGCTACTTAGGAGG,n/a
human,728621,CCDC30,XR_002957535.1,TRCN0000139826,NM_133477.1-4628s1c1,CCTCCTGAATAGCTGGGATTA,pLKO.1,2048,3UTR,90,89,,,Y,171024,SYNPO2,CCGGCCTCCTGAATAGCTGGGATTACTCGAGTAATCCCAGCTATTCAGGAGGTTTTTG,AATTCAAAAACCTCCTGAATAGCTGGGATTACTCGAGTAATCCCAGCTATTCAGGAGG,n/a
human,728621,CCDC30,XR_002957535.1,TRCN0000139201,NM_032120.1-1391s1c1,CCTCCTGAGTATCTGGGATTA,pLKO.1,2048,3UTR,90,89,,,Y,84060,RBM48,CCGGCCTCCTGAGTATCTGGGATTACTCGAGTAATCCCAGATACTCAGGAGGTTTTTG,AATTCAAAAACCTCCTGAGTATCTGGGATTACTCGAGTAATCCCAGATACTCAGGAGG,n/a
human,728621,CCDC30,XR_002957535.1,TRCN0000130981,NM_152906.2-1811s1c1,CCTCCTGATTAGCTGGGATTA,pLKO.1,2048,3UTR,90,89,,,Y,128989,TANGO2,CCGGCCTCCTGATTAGCTGGGATTACTCGAGTAATCCCAGCTAATCAGGAGGTTTTTG,AATTCAAAAACCTCCTGATTAGCTGGGATTACTCGAGTAATCCCAGCTAATCAGGAGG,n/a
human,728621,CCDC30,XR_002957535.1,TRCN0000156198,NM_004927.2-974s1c1,CCTCTTGAGTAGCTGGGATTA,pLKO.1,2048,3UTR,90,89,,,Y,740,MRPL49,CCGGCCTCTTGAGTAGCTGGGATTACTCGAGTAATCCCAGCTACTCAAGAGGTTTTTG,AATTCAAAAACCTCTTGAGTAGCTGGGATTACTCGAGTAATCCCAGCTACTCAAGAGG,n/a
human,728621,CCDC30,XR_002957535.1,TRCN0000276507,NM_004927.2-974s21c1,CCTCTTGAGTAGCTGGGATTA,pLKO_005,2048,3UTR,90,89,,,Y,740,MRPL49,CCGGCCTCTTGAGTAGCTGGGATTACTCGAGTAATCCCAGCTACTCAAGAGGTTTTTG,AATTCAAAAACCTCTTGAGTAGCTGGGATTACTCGAGTAATCCCAGCTACTCAAGAGG,n/a
human,728621,CCDC30,XR_002957535.1,TRCN0000139739,NM_018265.1-2935s1c1,CCTTCTGAGTAGCTGGGATTA,pLKO.1,2048,3UTR,90,89,,,Y,55765,INAVA,CCGGCCTTCTGAGTAGCTGGGATTACTCGAGTAATCCCAGCTACTCAGAAGGTTTTTG,AATTCAAAAACCTTCTGAGTAGCTGGGATTACTCGAGTAATCCCAGCTACTCAGAAGG,n/a
human,728621,CCDC30,XR_002957535.1,TRCN0000040213,NM_000618.2-6169s1c1,CCTCCCAAATTGCTGGGATTA,pLKO.1,664,3UTR,90,89,,,Y,3479,IGF1,CCGGCCTCCCAAATTGCTGGGATTACTCGAGTAATCCCAGCAATTTGGGAGGTTTTTG,AATTCAAAAACCTCCCAAATTGCTGGGATTACTCGAGTAATCCCAGCAATTTGGGAGG,n/a
human,728621,CCDC30,XR_002957535.1,TRCN0000155836,NM_198582.1-3275s1c1,CCCAAAGTGCTGGGATTACAA,pLKO.1,667,3UTR,85,89,,,Y,377007,KLHL30,CCGGCCCAAAGTGCTGGGATTACAACTCGAGTTGTAATCCCAGCACTTTGGGTTTTTG,AATTCAAAAACCCAAAGTGCTGGGATTACAACTCGAGTTGTAATCCCAGCACTTTGGG,n/a
human,728621,CCDC30,XR_002957535.1,TRCN0000157610,NM_024565.4-569s1c1,GTGGCATGATCTCAGCTCATT,pLKO.1,1985,3UTR,85,89,,,Y,79616,CCNJL,CCGGGTGGCATGATCTCAGCTCATTCTCGAGAATGAGCTGAGATCATGCCACTTTTTG,AATTCAAAAAGTGGCATGATCTCAGCTCATTCTCGAGAATGAGCTGAGATCATGCCAC,n/a
human,728621,CCDC30,XR_002957535.1,TRCN0000134549,NM_144979.2-320s1c1,GAAGATGAGTTAGTTCCTGTA,pLKO.1,2595,3UTR,80,89,,,Y,166863,RBM46,CCGGGAAGATGAGTTAGTTCCTGTACTCGAGTACAGGAACTAACTCATCTTCTTTTTG,AATTCAAAAAGAAGATGAGTTAGTTCCTGTACTCGAGTACAGGAACTAACTCATCTTC,n/a
human,728621,CCDC30,XR_002957535.1,TRCN0000003318,NM_000660.x-1606s1c1,CCGGCCTTTCCTGCTTCTCAT,pLKO.1,143,3UTR,80,89,,,Y,7040,TGFB1,CCGGCCGGCCTTTCCTGCTTCTCATCTCGAGATGAGAAGCAGGAAAGGCCGGTTTTTG,AATTCAAAAACCGGCCTTTCCTGCTTCTCATCTCGAGATGAGAAGCAGGAAAGGCCGG,n/a
human,728621,CCDC30,XR_002957535.1,TRCN0000349551,NM_000660.3-1629s21c1,CCGGCCTTTCCTGCTTCTCAT,pLKO_005,143,3UTR,80,89,,,Y,7040,TGFB1,CCGGCCGGCCTTTCCTGCTTCTCATCTCGAGATGAGAAGCAGGAAAGGCCGGTTTTTG,AATTCAAAAACCGGCCTTTCCTGCTTCTCATCTCGAGATGAGAAGCAGGAAAGGCCGG,n/a
human,728621,CCDC30,XR_002957535.1,TRCN0000141025,NM_152361.1-835s1c1,CCCAAAGTGCTGGGATTACTT,pLKO.1,667,3UTR,80,89,,,Y,126272,EID2B,CCGGCCCAAAGTGCTGGGATTACTTCTCGAGAAGTAATCCCAGCACTTTGGGTTTTTG,AATTCAAAAACCCAAAGTGCTGGGATTACTTCTCGAGAAGTAATCCCAGCACTTTGGG,n/a
human,728621,CCDC30,XR_002957535.1,TRCN0000176005,NM_010329.1-458s1c1,GAGAGTACAACCACTGTCAAA,pLKO.1,1379,3UTR,80,89,,,Y,14726,Pdpn,CCGGGAGAGTACAACCACTGTCAAACTCGAGTTTGACAGTGGTTGTACTCTCTTTTTG,AATTCAAAAAGAGAGTACAACCACTGTCAAACTCGAGTTTGACAGTGGTTGTACTCTC,n/a
human,728621,CCDC30,XR_002957535.1,TRCN0000093822,NM_139197.1-581s1c1,GAGCCCACAAAGAAGTGGATT,pLKO.1,2613,3UTR,80,89,,,Y,227671,Gbgt1,CCGGGAGCCCACAAAGAAGTGGATTCTCGAGAATCCACTTCTTTGTGGGCTCTTTTTG,AATTCAAAAAGAGCCCACAAAGAAGTGGATTCTCGAGAATCCACTTCTTTGTGGGCTC,n/a
human,728621,CCDC30,XR_002957535.1,TRCN0000087636,XM_484396.2-241s1c1,CTGAGGCCACAAGAAGAGAAA,pLKO.1,2611,3UTR,86,85,,,Y,72661,Serp2,CCGGCTGAGGCCACAAGAAGAGAAACTCGAGTTTCTCTTCTTGTGGCCTCAGTTTTTG,AATTCAAAAACTGAGGCCACAAGAAGAGAAACTCGAGTTTCTCTTCTTGTGGCCTCAG,n/a
human,728621,CCDC30,XR_002957535.1,TRCN0000314883,NM_006225.3-2014s21c1,GCTCAACATCAGGGTCATTTC,pLKO_005,560,3UTR,77,85,,,Y,5333,PLCD1,CCGGGCTCAACATCAGGGTCATTTCCTCGAGGAAATGACCCTGATGTTGAGCTTTTTG,AATTCAAAAAGCTCAACATCAGGGTCATTTCCTCGAGGAAATGACCCTGATGTTGAGC,n/a
