Taxon,"Gene ID","Gene Symbol",Transcript,"Clone ID","Legacy Clone Name","Target Seq",Vector,"Match Position","Match Region","Match %","SDR Match %","Intrinsic Score","Adjusted Score","Matches Other Gene in Same Taxon?","Orig. Target Gene ID","Orig. Target Gene Symbol","Forward Oligo Sequence","Reverse Oligo Sequence",Addgene
human,112268131,LOC112268131,XR_002957598.1,TRCN0000139739,NM_018265.1-2935s1c1,CCTTCTGAGTAGCTGGGATTA,pLKO.1,899,3UTR,100,100,10.8,5.4,Y,55765,INAVA,CCGGCCTTCTGAGTAGCTGGGATTACTCGAGTAATCCCAGCTACTCAGAAGGTTTTTG,AATTCAAAAACCTTCTGAGTAGCTGGGATTACTCGAGTAATCCCAGCTACTCAGAAGG,n/a
human,112268131,LOC112268131,XR_002957598.1,TRCN0000155836,NM_198582.1-3275s1c1,CCCAAAGTGCTGGGATTACAA,pLKO.1,1042,3UTR,95,100,5.625,2.8125,Y,377007,KLHL30,CCGGCCCAAAGTGCTGGGATTACAACTCGAGTTGTAATCCCAGCACTTTGGGTTTTTG,AATTCAAAAACCCAAAGTGCTGGGATTACAACTCGAGTTGTAATCCCAGCACTTTGGG,n/a
human,112268131,LOC112268131,XR_002957598.1,TRCN0000141025,NM_152361.1-835s1c1,CCCAAAGTGCTGGGATTACTT,pLKO.1,1042,3UTR,90,100,5.625,2.8125,Y,126272,EID2B,CCGGCCCAAAGTGCTGGGATTACTTCTCGAGAAGTAATCCCAGCACTTTGGGTTTTTG,AATTCAAAAACCCAAAGTGCTGGGATTACTTCTCGAGAAGTAATCCCAGCACTTTGGG,n/a
human,112268131,LOC112268131,XR_002957598.1,TRCN0000204533,NM_001013675.1-1987s1c1,CCTCCCAAAGTGCTGGAATTA,pLKO.1,1039,3UTR,95,95,,,Y,400891,LRRC74B,CCGGCCTCCCAAAGTGCTGGAATTACTCGAGTAATTCCAGCACTTTGGGAGGTTTTTG,AATTCAAAAACCTCCCAAAGTGCTGGAATTACTCGAGTAATTCCAGCACTTTGGGAGG,n/a
human,112268131,LOC112268131,XR_002957598.1,TRCN0000063698,NM_006989.3-4525s1c1,GCCCAGCTAATTCTTGTATTT,pLKO.1,938,3UTR,95,95,,,Y,10156,RASA4,CCGGGCCCAGCTAATTCTTGTATTTCTCGAGAAATACAAGAATTAGCTGGGCTTTTTG,AATTCAAAAAGCCCAGCTAATTCTTGTATTTCTCGAGAAATACAAGAATTAGCTGGGC,n/a
human,112268131,LOC112268131,XR_002957598.1,TRCN0000150276,NM_144718.2-3773s1c1,GCCCAGCTAATTTGTGTATTT,pLKO.1,938,3UTR,95,95,,,Y,152185,SPICE1,CCGGGCCCAGCTAATTTGTGTATTTCTCGAGAAATACACAAATTAGCTGGGCTTTTTG,AATTCAAAAAGCCCAGCTAATTTGTGTATTTCTCGAGAAATACACAAATTAGCTGGGC,n/a
human,112268131,LOC112268131,XR_002957598.1,TRCN0000072628,NM_016065.3-1636s1c1,CCTCCCAAAGTGCTAGGATTA,pLKO.1,1039,3UTR,95,95,,,Y,51021,MRPS16,CCGGCCTCCCAAAGTGCTAGGATTACTCGAGTAATCCTAGCACTTTGGGAGGTTTTTG,AATTCAAAAACCTCCCAAAGTGCTAGGATTACTCGAGTAATCCTAGCACTTTGGGAGG,n/a
human,112268131,LOC112268131,XR_002957598.1,TRCN0000165534,NM_001012717.1-362s1c1,GAGACAGGGTTTCACCATGTT,pLKO.1,965,3UTR,95,95,,,Y,,,CCGGGAGACAGGGTTTCACCATGTTCTCGAGAACATGGTGAAACCCTGTCTCTTTTTG,AATTCAAAAAGAGACAGGGTTTCACCATGTTCTCGAGAACATGGTGAAACCCTGTCTC,n/a
human,112268131,LOC112268131,XR_002957598.1,TRCN0000164801,NM_016534.2-1646s1c1,CCTCCCAAAGTACTGGGATTA,pLKO.1,1039,3UTR,95,95,,,Y,51275,MAPKAPK5-AS1,CCGGCCTCCCAAAGTACTGGGATTACTCGAGTAATCCCAGTACTTTGGGAGGTTTTTG,AATTCAAAAACCTCCCAAAGTACTGGGATTACTCGAGTAATCCCAGTACTTTGGGAGG,n/a
human,112268131,LOC112268131,XR_002957598.1,TRCN0000008902,NM_016540.2-2291s1c1,CCTCCCAAAGTGTTGGGATTA,pLKO.1,1039,3UTR,95,95,,,Y,10888,GPR83,CCGGCCTCCCAAAGTGTTGGGATTACTCGAGTAATCCCAACACTTTGGGAGGTTTTTG,AATTCAAAAACCTCCCAAAGTGTTGGGATTACTCGAGTAATCCCAACACTTTGGGAGG,n/a
human,112268131,LOC112268131,XR_002957598.1,TRCN0000156315,NM_020702.1-3633s1c1,CCTCCCAAAGTGTTGGGATTA,pLKO.1,1039,3UTR,95,95,,,Y,57462,MYORG,CCGGCCTCCCAAAGTGTTGGGATTACTCGAGTAATCCCAACACTTTGGGAGGTTTTTG,AATTCAAAAACCTCCCAAAGTGTTGGGATTACTCGAGTAATCCCAACACTTTGGGAGG,n/a
human,112268131,LOC112268131,XR_002957598.1,TRCN0000116227,NM_024930.1-2895s1c1,CCTCCCAAAGTTCTGGGATTA,pLKO.1,1039,3UTR,95,95,,,Y,79993,ELOVL7,CCGGCCTCCCAAAGTTCTGGGATTACTCGAGTAATCCCAGAACTTTGGGAGGTTTTTG,AATTCAAAAACCTCCCAAAGTTCTGGGATTACTCGAGTAATCCCAGAACTTTGGGAGG,n/a
human,112268131,LOC112268131,XR_002957598.1,TRCN0000164591,NM_003281.3-2102s1c1,CCTCCCAAAGTTCTGGGATTA,pLKO.1,1039,3UTR,95,95,,,Y,7135,TNNI1,CCGGCCTCCCAAAGTTCTGGGATTACTCGAGTAATCCCAGAACTTTGGGAGGTTTTTG,AATTCAAAAACCTCCCAAAGTTCTGGGATTACTCGAGTAATCCCAGAACTTTGGGAGG,n/a
human,112268131,LOC112268131,XR_002957598.1,TRCN0000040213,NM_000618.2-6169s1c1,CCTCCCAAATTGCTGGGATTA,pLKO.1,1039,3UTR,95,95,,,Y,3479,IGF1,CCGGCCTCCCAAATTGCTGGGATTACTCGAGTAATCCCAGCAATTTGGGAGGTTTTTG,AATTCAAAAACCTCCCAAATTGCTGGGATTACTCGAGTAATCCCAGCAATTTGGGAGG,n/a
human,112268131,LOC112268131,XR_002957598.1,TRCN0000162795,NM_017842.1-1079s1c1,CTTCCAAAGTGCTGGGATTAT,pLKO.1,1040,3UTR,90,95,,,Y,55652,SLC48A1,CCGGCTTCCAAAGTGCTGGGATTATCTCGAGATAATCCCAGCACTTTGGAAGTTTTTG,AATTCAAAAACTTCCAAAGTGCTGGGATTATCTCGAGATAATCCCAGCACTTTGGAAG,n/a
human,112268131,LOC112268131,XR_002957598.1,TRCN0000140657,NM_012099.1-2957s1c1,CCTCCCAAAGTGCTAGGATAA,pLKO.1,1039,3UTR,90,95,,,Y,10849,CD3EAP,CCGGCCTCCCAAAGTGCTAGGATAACTCGAGTTATCCTAGCACTTTGGGAGGTTTTTG,AATTCAAAAACCTCCCAAAGTGCTAGGATAACTCGAGTTATCCTAGCACTTTGGGAGG,n/a
human,112268131,LOC112268131,XR_002957598.1,TRCN0000157407,NM_001003795.1-3187s1c1,GATCTCGGCTTACTGCAACTT,pLKO.1,843,3UTR,90,95,,,Y,389524,GTF2IRD2B,CCGGGATCTCGGCTTACTGCAACTTCTCGAGAAGTTGCAGTAAGCCGAGATCTTTTTG,AATTCAAAAAGATCTCGGCTTACTGCAACTTCTCGAGAAGTTGCAGTAAGCCGAGATC,n/a
human,112268131,LOC112268131,XR_002957598.1,TRCN0000130146,NM_207443.1-652s1c1,CAGGTTCAAGTGATTCTCCTA,pLKO.1,872,3UTR,90,95,,,Y,400242,DICER1-AS1,CCGGCAGGTTCAAGTGATTCTCCTACTCGAGTAGGAGAATCACTTGAACCTGTTTTTG,AATTCAAAAACAGGTTCAAGTGATTCTCCTACTCGAGTAGGAGAATCACTTGAACCTG,n/a
human,112268131,LOC112268131,XR_002957598.1,TRCN0000047783,NM_017516.1-1624s1c1,GCCTCCAAAGTGCTGGAATTA,pLKO.1,1038,3UTR,90,90,,,Y,54734,RAB39A,CCGGGCCTCCAAAGTGCTGGAATTACTCGAGTAATTCCAGCACTTTGGAGGCTTTTTG,AATTCAAAAAGCCTCCAAAGTGCTGGAATTACTCGAGTAATTCCAGCACTTTGGAGGC,n/a
human,112268131,LOC112268131,XR_002957598.1,TRCN0000091448,NM_013513.1-2495s1c1,CCTCCCAAGTACTGGGATTAA,pLKO.1,1039,3UTR,86,90,,,Y,13828,Epb42,CCGGCCTCCCAAGTACTGGGATTAACTCGAGTTAATCCCAGTACTTGGGAGGTTTTTG,AATTCAAAAACCTCCCAAGTACTGGGATTAACTCGAGTTAATCCCAGTACTTGGGAGG,n/a
human,112268131,LOC112268131,XR_002957598.1,TRCN0000072463,NM_001001563.1-2222s1c1,GCTACCATACCCAGCTAATTT,pLKO.1,930,3UTR,90,89,,,Y,92609,TIMM50,CCGGGCTACCATACCCAGCTAATTTCTCGAGAAATTAGCTGGGTATGGTAGCTTTTTG,AATTCAAAAAGCTACCATACCCAGCTAATTTCTCGAGAAATTAGCTGGGTATGGTAGC,n/a
human,112268131,LOC112268131,XR_002957598.1,TRCN0000149509,NM_145283.1-707s1c1,GTTCAAGTGATTCTCTAGCCT,pLKO.1,875,3UTR,90,89,,,Y,158046,NXNL2,CCGGGTTCAAGTGATTCTCTAGCCTCTCGAGAGGCTAGAGAATCACTTGAACTTTTTG,AATTCAAAAAGTTCAAGTGATTCTCTAGCCTCTCGAGAGGCTAGAGAATCACTTGAAC,n/a
human,112268131,LOC112268131,XR_002957598.1,TRCN0000042823,NM_024055.2-973s1c1,CCTCACAAAGTGCTAGGATTA,pLKO.1,1039,3UTR,90,89,,,Y,64924,SLC30A5,CCGGCCTCACAAAGTGCTAGGATTACTCGAGTAATCCTAGCACTTTGTGAGGTTTTTG,AATTCAAAAACCTCACAAAGTGCTAGGATTACTCGAGTAATCCTAGCACTTTGTGAGG,n/a
human,112268131,LOC112268131,XR_002957598.1,TRCN0000082462,XM_371492.2-638s1c1,CCTCCCAAAGTGCCAGGATTA,pLKO.1,1039,3UTR,90,89,,,Y,388949,LOC388949,CCGGCCTCCCAAAGTGCCAGGATTACTCGAGTAATCCTGGCACTTTGGGAGGTTTTTG,AATTCAAAAACCTCCCAAAGTGCCAGGATTACTCGAGTAATCCTGGCACTTTGGGAGG,n/a
human,112268131,LOC112268131,XR_002957598.1,TRCN0000165736,NM_175901.3-1946s1c1,CCTCCCTAAGTGTTGGGATTA,pLKO.1,1039,3UTR,90,89,,,Y,283932,FBXL19-AS1,CCGGCCTCCCTAAGTGTTGGGATTACTCGAGTAATCCCAACACTTAGGGAGGTTTTTG,AATTCAAAAACCTCCCTAAGTGTTGGGATTACTCGAGTAATCCCAACACTTAGGGAGG,n/a
human,112268131,LOC112268131,XR_002957598.1,TRCN0000166560,NM_207497.1-412s1c1,CCTCCGAAAGTGCTAGGATTA,pLKO.1,1039,3UTR,90,89,,,Y,401253,LINC00336,CCGGCCTCCGAAAGTGCTAGGATTACTCGAGTAATCCTAGCACTTTCGGAGGTTTTTG,AATTCAAAAACCTCCGAAAGTGCTAGGATTACTCGAGTAATCCTAGCACTTTCGGAGG,n/a
human,112268131,LOC112268131,XR_002957598.1,TRCN0000164091,NM_024795.1-1273s1c1,CCTCCTAAAGTGCTGCGATTA,pLKO.1,1039,3UTR,90,89,,,Y,79853,TM4SF20,CCGGCCTCCTAAAGTGCTGCGATTACTCGAGTAATCGCAGCACTTTAGGAGGTTTTTG,AATTCAAAAACCTCCTAAAGTGCTGCGATTACTCGAGTAATCGCAGCACTTTAGGAGG,n/a
human,112268131,LOC112268131,XR_002957598.1,TRCN0000165774,NM_001012391.1-946s1c1,CCTCCTAAGTAGCTGGGATTA,pLKO.1,899,3UTR,90,89,,,Y,100652781,SNX29P1,CCGGCCTCCTAAGTAGCTGGGATTACTCGAGTAATCCCAGCTACTTAGGAGGTTTTTG,AATTCAAAAACCTCCTAAGTAGCTGGGATTACTCGAGTAATCCCAGCTACTTAGGAGG,n/a
human,112268131,LOC112268131,XR_002957598.1,TRCN0000139826,NM_133477.1-4628s1c1,CCTCCTGAATAGCTGGGATTA,pLKO.1,899,3UTR,90,89,,,Y,171024,SYNPO2,CCGGCCTCCTGAATAGCTGGGATTACTCGAGTAATCCCAGCTATTCAGGAGGTTTTTG,AATTCAAAAACCTCCTGAATAGCTGGGATTACTCGAGTAATCCCAGCTATTCAGGAGG,n/a
human,112268131,LOC112268131,XR_002957598.1,TRCN0000139201,NM_032120.1-1391s1c1,CCTCCTGAGTATCTGGGATTA,pLKO.1,899,3UTR,90,89,,,Y,84060,RBM48,CCGGCCTCCTGAGTATCTGGGATTACTCGAGTAATCCCAGATACTCAGGAGGTTTTTG,AATTCAAAAACCTCCTGAGTATCTGGGATTACTCGAGTAATCCCAGATACTCAGGAGG,n/a
human,112268131,LOC112268131,XR_002957598.1,TRCN0000130981,NM_152906.2-1811s1c1,CCTCCTGATTAGCTGGGATTA,pLKO.1,899,3UTR,90,89,,,Y,128989,TANGO2,CCGGCCTCCTGATTAGCTGGGATTACTCGAGTAATCCCAGCTAATCAGGAGGTTTTTG,AATTCAAAAACCTCCTGATTAGCTGGGATTACTCGAGTAATCCCAGCTAATCAGGAGG,n/a
human,112268131,LOC112268131,XR_002957598.1,TRCN0000138395,XM_374933.1-1847s1c1,CCTTCCAAGTAGCTGGGATTA,pLKO.1,899,3UTR,90,89,,,Y,399949,C11orf88,CCGGCCTTCCAAGTAGCTGGGATTACTCGAGTAATCCCAGCTACTTGGAAGGTTTTTG,AATTCAAAAACCTTCCAAGTAGCTGGGATTACTCGAGTAATCCCAGCTACTTGGAAGG,n/a
human,112268131,LOC112268131,XR_002957598.1,TRCN0000162985,NM_207497.1-342s1c1,GAGACAAGGTTTCACCATGTT,pLKO.1,965,3UTR,90,89,,,Y,401253,LINC00336,CCGGGAGACAAGGTTTCACCATGTTCTCGAGAACATGGTGAAACCTTGTCTCTTTTTG,AATTCAAAAAGAGACAAGGTTTCACCATGTTCTCGAGAACATGGTGAAACCTTGTCTC,n/a
human,112268131,LOC112268131,XR_002957598.1,TRCN0000140238,NM_024895.3-1807s1c1,GTCTCCCAAAGTGCTAGGATT,pLKO.1,1038,3UTR,90,89,,,Y,79955,PDZD7,CCGGGTCTCCCAAAGTGCTAGGATTCTCGAGAATCCTAGCACTTTGGGAGACTTTTTG,AATTCAAAAAGTCTCCCAAAGTGCTAGGATTCTCGAGAATCCTAGCACTTTGGGAGAC,n/a
human,112268131,LOC112268131,XR_002957598.1,TRCN0000129445,NM_145048.2-1500s1c1,GACTTCCAAAGTGCTGGGATT,pLKO.1,1038,3UTR,90,89,,,Y,133015,PACRGL,CCGGGACTTCCAAAGTGCTGGGATTCTCGAGAATCCCAGCACTTTGGAAGTCTTTTTG,AATTCAAAAAGACTTCCAAAGTGCTGGGATTCTCGAGAATCCCAGCACTTTGGAAGTC,n/a
human,112268131,LOC112268131,XR_002957598.1,TRCN0000140759,NM_018265.1-3067s1c1,GCCTTTCAAAGTGCTGGGATT,pLKO.1,1038,3UTR,90,89,,,Y,55765,INAVA,CCGGGCCTTTCAAAGTGCTGGGATTCTCGAGAATCCCAGCACTTTGAAAGGCTTTTTG,AATTCAAAAAGCCTTTCAAAGTGCTGGGATTCTCGAGAATCCCAGCACTTTGAAAGGC,n/a
human,112268131,LOC112268131,XR_002957598.1,TRCN0000155070,NM_017873.2-2761s1c1,GCCTTTCAAAGTGCTGGGATT,pLKO.1,1038,3UTR,90,89,,,Y,140459,ASB6,CCGGGCCTTTCAAAGTGCTGGGATTCTCGAGAATCCCAGCACTTTGAAAGGCTTTTTG,AATTCAAAAAGCCTTTCAAAGTGCTGGGATTCTCGAGAATCCCAGCACTTTGAAAGGC,n/a
human,112268131,LOC112268131,XR_002957598.1,TRCN0000163829,NM_173639.1-1102s1c1,CCTCCCAAATTACTGGGATTA,pLKO.1,1039,3UTR,90,89,,,Y,284618,RUSC1-AS1,CCGGCCTCCCAAATTACTGGGATTACTCGAGTAATCCCAGTAATTTGGGAGGTTTTTG,AATTCAAAAACCTCCCAAATTACTGGGATTACTCGAGTAATCCCAGTAATTTGGGAGG,n/a
human,112268131,LOC112268131,XR_002957598.1,TRCN0000057398,NM_002261.1-793s1c1,CCTCCCAAGTTGCTGGGATTA,pLKO.1,1039,3UTR,90,89,,,Y,3823,KLRC3,CCGGCCTCCCAAGTTGCTGGGATTACTCGAGTAATCCCAGCAACTTGGGAGGTTTTTG,AATTCAAAAACCTCCCAAGTTGCTGGGATTACTCGAGTAATCCCAGCAACTTGGGAGG,n/a
human,112268131,LOC112268131,XR_002957598.1,TRCN0000140374,NM_025042.2-1098s1c1,GCTTCCCAAAGTACTGGGATT,pLKO.1,1038,3UTR,90,89,,,Y,,,CCGGGCTTCCCAAAGTACTGGGATTCTCGAGAATCCCAGTACTTTGGGAAGCTTTTTG,AATTCAAAAAGCTTCCCAAAGTACTGGGATTCTCGAGAATCCCAGTACTTTGGGAAGC,n/a
human,112268131,LOC112268131,XR_002957598.1,TRCN0000434335,NM_020256.2-1113s21c1,CACATCTGACTCCTAACATTA,pLKO_005,1949,3UTR,85,89,,,Y,56805,Zbtb33,CCGGCACATCTGACTCCTAACATTACTCGAGTAATGTTAGGAGTCAGATGTGTTTTTG,AATTCAAAAACACATCTGACTCCTAACATTACTCGAGTAATGTTAGGAGTCAGATGTG,n/a
human,112268131,LOC112268131,XR_002957598.1,TRCN0000337418,NM_001114403.1-1038s21c1,CCTCACGGGTTCAAGCGATTT,pLKO_005,867,3UTR,85,89,,,Y,100134938,UPK3BL1,CCGGCCTCACGGGTTCAAGCGATTTCTCGAGAAATCGCTTGAACCCGTGAGGTTTTTG,AATTCAAAAACCTCACGGGTTCAAGCGATTTCTCGAGAAATCGCTTGAACCCGTGAGG,n/a
human,112268131,LOC112268131,XR_002957598.1,TRCN0000141125,NM_153233.1-1432s1c1,CAGGTTCAAGAGATTCTCCTA,pLKO.1,872,3UTR,85,89,,,Y,163183,SYNE4,CCGGCAGGTTCAAGAGATTCTCCTACTCGAGTAGGAGAATCTCTTGAACCTGTTTTTG,AATTCAAAAACAGGTTCAAGAGATTCTCCTACTCGAGTAGGAGAATCTCTTGAACCTG,n/a
human,112268131,LOC112268131,XR_002957598.1,TRCN0000375096,NM_026823.2-186s21c1,CCTGTTCTGGAAGGAGGAAAT,pLKO_005,3214,3UTR,80,89,,,Y,68724,Arl8a,CCGGCCTGTTCTGGAAGGAGGAAATCTCGAGATTTCCTCCTTCCAGAACAGGTTTTTG,AATTCAAAAACCTGTTCTGGAAGGAGGAAATCTCGAGATTTCCTCCTTCCAGAACAGG,n/a
human,112268131,LOC112268131,XR_002957598.1,TRCN0000062280,NM_018368.2-767s1c1,GCGTTACCTTTAAATCTGATA,pLKO.1,1378,3UTR,80,89,,,Y,55788,LMBRD1,CCGGGCGTTACCTTTAAATCTGATACTCGAGTATCAGATTTAAAGGTAACGCTTTTTG,AATTCAAAAAGCGTTACCTTTAAATCTGATACTCGAGTATCAGATTTAAAGGTAACGC,n/a
human,112268131,LOC112268131,XR_002957598.1,TRCN0000299400,NM_018368.2-767s21c1,GCGTTACCTTTAAATCTGATA,pLKO_005,1378,3UTR,80,89,,,Y,55788,LMBRD1,CCGGGCGTTACCTTTAAATCTGATACTCGAGTATCAGATTTAAAGGTAACGCTTTTTG,AATTCAAAAAGCGTTACCTTTAAATCTGATACTCGAGTATCAGATTTAAAGGTAACGC,n/a
human,112268131,LOC112268131,XR_002957598.1,TRCN0000035154,NM_031422.1-697s1c1,CCCAAGAGAAACGAAGGTCTT,pLKO.1,365,3UTR,80,89,,,Y,83539,CHST9,CCGGCCCAAGAGAAACGAAGGTCTTCTCGAGAAGACCTTCGTTTCTCTTGGGTTTTTG,AATTCAAAAACCCAAGAGAAACGAAGGTCTTCTCGAGAAGACCTTCGTTTCTCTTGGG,n/a
human,112268131,LOC112268131,XR_002957598.1,TRCN0000168807,NM_178520.2-2253s1c1,GCTGATCTCAAACTCCTGATA,pLKO.1,992,3UTR,80,89,,,Y,284186,TMEM105,CCGGGCTGATCTCAAACTCCTGATACTCGAGTATCAGGAGTTTGAGATCAGCTTTTTG,AATTCAAAAAGCTGATCTCAAACTCCTGATACTCGAGTATCAGGAGTTTGAGATCAGC,n/a
human,112268131,LOC112268131,XR_002957598.1,TRCN0000426206,NM_003687.3-935s21c1,GAACCTCAAGCAGCGTGGTTA,pLKO_005,1697,3UTR,82,86,,,Y,8572,PDLIM4,CCGGGAACCTCAAGCAGCGTGGTTACTCGAGTAACCACGCTGCTTGAGGTTCTTTTTG,AATTCAAAAAGAACCTCAAGCAGCGTGGTTACTCGAGTAACCACGCTGCTTGAGGTTC,n/a
