Taxon,"Gene ID","Gene Symbol",Transcript,"Clone ID","Legacy Clone Name","Target Seq",Vector,"Match Position","Match Region","Match %","SDR Match %","Intrinsic Score","Adjusted Score","Matches Other Gene in Same Taxon?","Orig. Target Gene ID","Orig. Target Gene Symbol","Forward Oligo Sequence","Reverse Oligo Sequence",Addgene
human,105372446,LOC105372446,XR_002958398.1,TRCN0000008902,NM_016540.2-2291s1c1,CCTCCCAAAGTGTTGGGATTA,pLKO.1,975,3UTR,100,100,1.08,.54,Y,10888,GPR83,CCGGCCTCCCAAAGTGTTGGGATTACTCGAGTAATCCCAACACTTTGGGAGGTTTTTG,AATTCAAAAACCTCCCAAAGTGTTGGGATTACTCGAGTAATCCCAACACTTTGGGAGG,n/a
human,105372446,LOC105372446,XR_002958398.1,TRCN0000156315,NM_020702.1-3633s1c1,CCTCCCAAAGTGTTGGGATTA,pLKO.1,975,3UTR,100,100,1.08,.54,Y,57462,MYORG,CCGGCCTCCCAAAGTGTTGGGATTACTCGAGTAATCCCAACACTTTGGGAGGTTTTTG,AATTCAAAAACCTCCCAAAGTGTTGGGATTACTCGAGTAATCCCAACACTTTGGGAGG,n/a
human,105372446,LOC105372446,XR_002958398.1,TRCN0000165736,NM_175901.3-1946s1c1,CCTCCCTAAGTGTTGGGATTA,pLKO.1,975,3UTR,95,95,,,Y,283932,FBXL19-AS1,CCGGCCTCCCTAAGTGTTGGGATTACTCGAGTAATCCCAACACTTAGGGAGGTTTTTG,AATTCAAAAACCTCCCTAAGTGTTGGGATTACTCGAGTAATCCCAACACTTAGGGAGG,n/a
human,105372446,LOC105372446,XR_002958398.1,TRCN0000165534,NM_001012717.1-362s1c1,GAGACAGGGTTTCACCATGTT,pLKO.1,905,3UTR,95,95,,,Y,,,CCGGGAGACAGGGTTTCACCATGTTCTCGAGAACATGGTGAAACCCTGTCTCTTTTTG,AATTCAAAAAGAGACAGGGTTTCACCATGTTCTCGAGAACATGGTGAAACCCTGTCTC,n/a
human,105372446,LOC105372446,XR_002958398.1,TRCN0000155836,NM_198582.1-3275s1c1,CCCAAAGTGCTGGGATTACAA,pLKO.1,978,3UTR,90,95,,,Y,377007,KLHL30,CCGGCCCAAAGTGCTGGGATTACAACTCGAGTTGTAATCCCAGCACTTTGGGTTTTTG,AATTCAAAAACCCAAAGTGCTGGGATTACAACTCGAGTTGTAATCCCAGCACTTTGGG,n/a
human,105372446,LOC105372446,XR_002958398.1,TRCN0000141025,NM_152361.1-835s1c1,CCCAAAGTGCTGGGATTACTT,pLKO.1,978,3UTR,85,95,,,Y,126272,EID2B,CCGGCCCAAAGTGCTGGGATTACTTCTCGAGAAGTAATCCCAGCACTTTGGGTTTTTG,AATTCAAAAACCCAAAGTGCTGGGATTACTTCTCGAGAAGTAATCCCAGCACTTTGGG,n/a
human,105372446,LOC105372446,XR_002958398.1,TRCN0000204533,NM_001013675.1-1987s1c1,CCTCCCAAAGTGCTGGAATTA,pLKO.1,975,3UTR,90,89,,,Y,400891,LRRC74B,CCGGCCTCCCAAAGTGCTGGAATTACTCGAGTAATTCCAGCACTTTGGGAGGTTTTTG,AATTCAAAAACCTCCCAAAGTGCTGGAATTACTCGAGTAATTCCAGCACTTTGGGAGG,n/a
human,105372446,LOC105372446,XR_002958398.1,TRCN0000072628,NM_016065.3-1636s1c1,CCTCCCAAAGTGCTAGGATTA,pLKO.1,975,3UTR,90,89,,,Y,51021,MRPS16,CCGGCCTCCCAAAGTGCTAGGATTACTCGAGTAATCCTAGCACTTTGGGAGGTTTTTG,AATTCAAAAACCTCCCAAAGTGCTAGGATTACTCGAGTAATCCTAGCACTTTGGGAGG,n/a
human,105372446,LOC105372446,XR_002958398.1,TRCN0000165027,NM_001013636.1-513s1c1,GAACTCCTGACCTCAAGTGAT,pLKO.1,941,3UTR,90,89,,,Y,387873,LOC387873,CCGGGAACTCCTGACCTCAAGTGATCTCGAGATCACTTGAGGTCAGGAGTTCTTTTTG,AATTCAAAAAGAACTCCTGACCTCAAGTGATCTCGAGATCACTTGAGGTCAGGAGTTC,n/a
human,105372446,LOC105372446,XR_002958398.1,TRCN0000162985,NM_207497.1-342s1c1,GAGACAAGGTTTCACCATGTT,pLKO.1,905,3UTR,90,89,,,Y,401253,LINC00336,CCGGGAGACAAGGTTTCACCATGTTCTCGAGAACATGGTGAAACCTTGTCTCTTTTTG,AATTCAAAAAGAGACAAGGTTTCACCATGTTCTCGAGAACATGGTGAAACCTTGTCTC,n/a
human,105372446,LOC105372446,XR_002958398.1,TRCN0000155187,NM_001003795.1-3305s1c1,GAGATGAGGTTTCACCATGTT,pLKO.1,905,3UTR,90,89,,,Y,389524,GTF2IRD2B,CCGGGAGATGAGGTTTCACCATGTTCTCGAGAACATGGTGAAACCTCATCTCTTTTTG,AATTCAAAAAGAGATGAGGTTTCACCATGTTCTCGAGAACATGGTGAAACCTCATCTC,n/a
human,105372446,LOC105372446,XR_002958398.1,TRCN0000168774,NM_001013670.1-1394s1c1,GAGATGGAGTTTCACCATGTT,pLKO.1,905,3UTR,90,89,,,Y,400464,LOC400464,CCGGGAGATGGAGTTTCACCATGTTCTCGAGAACATGGTGAAACTCCATCTCTTTTTG,AATTCAAAAAGAGATGGAGTTTCACCATGTTCTCGAGAACATGGTGAAACTCCATCTC,n/a
human,105372446,LOC105372446,XR_002958398.1,TRCN0000164801,NM_016534.2-1646s1c1,CCTCCCAAAGTACTGGGATTA,pLKO.1,975,3UTR,90,89,,,Y,51275,MAPKAPK5-AS1,CCGGCCTCCCAAAGTACTGGGATTACTCGAGTAATCCCAGTACTTTGGGAGGTTTTTG,AATTCAAAAACCTCCCAAAGTACTGGGATTACTCGAGTAATCCCAGTACTTTGGGAGG,n/a
human,105372446,LOC105372446,XR_002958398.1,TRCN0000116227,NM_024930.1-2895s1c1,CCTCCCAAAGTTCTGGGATTA,pLKO.1,975,3UTR,90,89,,,Y,79993,ELOVL7,CCGGCCTCCCAAAGTTCTGGGATTACTCGAGTAATCCCAGAACTTTGGGAGGTTTTTG,AATTCAAAAACCTCCCAAAGTTCTGGGATTACTCGAGTAATCCCAGAACTTTGGGAGG,n/a
human,105372446,LOC105372446,XR_002958398.1,TRCN0000164591,NM_003281.3-2102s1c1,CCTCCCAAAGTTCTGGGATTA,pLKO.1,975,3UTR,90,89,,,Y,7135,TNNI1,CCGGCCTCCCAAAGTTCTGGGATTACTCGAGTAATCCCAGAACTTTGGGAGGTTTTTG,AATTCAAAAACCTCCCAAAGTTCTGGGATTACTCGAGTAATCCCAGAACTTTGGGAGG,n/a
human,105372446,LOC105372446,XR_002958398.1,TRCN0000040213,NM_000618.2-6169s1c1,CCTCCCAAATTGCTGGGATTA,pLKO.1,975,3UTR,90,89,,,Y,3479,IGF1,CCGGCCTCCCAAATTGCTGGGATTACTCGAGTAATCCCAGCAATTTGGGAGGTTTTTG,AATTCAAAAACCTCCCAAATTGCTGGGATTACTCGAGTAATCCCAGCAATTTGGGAGG,n/a
human,105372446,LOC105372446,XR_002958398.1,TRCN0000268523,NM_001025459.2-179s21c1,TTCTGGTACAGGATCAGATGT,pLKO_005,1298,3UTR,85,89,,,Y,284009,LOC284009,CCGGTTCTGGTACAGGATCAGATGTCTCGAGACATCTGATCCTGTACCAGAATTTTTG,AATTCAAAAATTCTGGTACAGGATCAGATGTCTCGAGACATCTGATCCTGTACCAGAA,n/a
human,105372446,LOC105372446,XR_002958398.1,TRCN0000382132,NM_031945.3-242s21c1,AGACCAAGCACCAGGCCTTGA,pLKO_005,582,3UTR,85,89,,,Y,83882,TSPAN10,CCGGAGACCAAGCACCAGGCCTTGACTCGAGTCAAGGCCTGGTGCTTGGTCTTTTTTG,AATTCAAAAAAGACCAAGCACCAGGCCTTGACTCGAGTCAAGGCCTGGTGCTTGGTCT,n/a
human,105372446,LOC105372446,XR_002958398.1,TRCN0000138406,NM_016201.2-2824s1c1,CCCAGAAGACTCTGCTTCTTA,pLKO.1,1440,3UTR,85,89,,,Y,51421,AMOTL2,CCGGCCCAGAAGACTCTGCTTCTTACTCGAGTAAGAAGCAGAGTCTTCTGGGTTTTTG,AATTCAAAAACCCAGAAGACTCTGCTTCTTACTCGAGTAAGAAGCAGAGTCTTCTGGG,n/a
human,105372446,LOC105372446,XR_002958398.1,TRCN0000162795,NM_017842.1-1079s1c1,CTTCCAAAGTGCTGGGATTAT,pLKO.1,976,3UTR,85,89,,,Y,55652,SLC48A1,CCGGCTTCCAAAGTGCTGGGATTATCTCGAGATAATCCCAGCACTTTGGAAGTTTTTG,AATTCAAAAACTTCCAAAGTGCTGGGATTATCTCGAGATAATCCCAGCACTTTGGAAG,n/a
human,105372446,LOC105372446,XR_002958398.1,TRCN0000215441,NM_176994.2-1889s1c1,GAAATGTCACCTCTCACAAAT,pLKO.1,207,3UTR,85,89,,,Y,319743,9630013D21Rik,CCGGGAAATGTCACCTCTCACAAATCTCGAGATTTGTGAGAGGTGACATTTCTTTTTG,AATTCAAAAAGAAATGTCACCTCTCACAAATCTCGAGATTTGTGAGAGGTGACATTTC,n/a
human,105372446,LOC105372446,XR_002958398.1,TRCN0000140657,NM_012099.1-2957s1c1,CCTCCCAAAGTGCTAGGATAA,pLKO.1,975,3UTR,85,89,,,Y,10849,CD3EAP,CCGGCCTCCCAAAGTGCTAGGATAACTCGAGTTATCCTAGCACTTTGGGAGGTTTTTG,AATTCAAAAACCTCCCAAAGTGCTAGGATAACTCGAGTTATCCTAGCACTTTGGGAGG,n/a
human,105372446,LOC105372446,XR_002958398.1,TRCN0000161941,NM_001001695.1-449s1c1,GAAGTTCAAGATCAAGGTGTT,pLKO.1,810,3UTR,85,89,,,Y,400941,LINC00487,CCGGGAAGTTCAAGATCAAGGTGTTCTCGAGAACACCTTGATCTTGAACTTCTTTTTG,AATTCAAAAAGAAGTTCAAGATCAAGGTGTTCTCGAGAACACCTTGATCTTGAACTTC,n/a
human,105372446,LOC105372446,XR_002958398.1,TRCN0000011056,NM_013239.3-567s1c1,CCAAAGCATTCCGACCTTCTA,pLKO.1,1053,3UTR,80,89,,,Y,28227,PPP2R3B,CCGGCCAAAGCATTCCGACCTTCTACTCGAGTAGAAGGTCGGAATGCTTTGGTTTTTG,AATTCAAAAACCAAAGCATTCCGACCTTCTACTCGAGTAGAAGGTCGGAATGCTTTGG,n/a
human,105372446,LOC105372446,XR_002958398.1,TRCN0000172548,NM_015388.1-571s1c1,GTGAACTCTATGGACCTCTCA,pLKO.1,1218,3UTR,78,86,,,Y,25844,YIPF3,CCGGGTGAACTCTATGGACCTCTCACTCGAGTGAGAGGTCCATAGAGTTCACTTTTTG,AATTCAAAAAGTGAACTCTATGGACCTCTCACTCGAGTGAGAGGTCCATAGAGTTCAC,n/a
human,105372446,LOC105372446,XR_002958398.1,TRCN0000088527,NM_009650.1-623s1c1,GCCTCATTTCCCATGTTGGTA,pLKO.1,539,3UTR,77,85,,,Y,11642,Akap3,CCGGGCCTCATTTCCCATGTTGGTACTCGAGTACCAACATGGGAAATGAGGCTTTTTG,AATTCAAAAAGCCTCATTTCCCATGTTGGTACTCGAGTACCAACATGGGAAATGAGGC,n/a
human,105372446,LOC105372446,XR_002958398.1,TRCN0000123588,NM_134077.3-635s1c1,GCTGTGAATACAAAGAGTTAT,pLKO.1,1254,3UTR,77,85,,,Y,74213,Rbm26,CCGGGCTGTGAATACAAAGAGTTATCTCGAGATAACTCTTTGTATTCACAGCTTTTTG,AATTCAAAAAGCTGTGAATACAAAGAGTTATCTCGAGATAACTCTTTGTATTCACAGC,n/a
human,105372446,LOC105372446,XR_002958398.1,TRCN0000332086,NM_134077.4-698s21c1,GCTGTGAATACAAAGAGTTAT,pLKO_005,1254,3UTR,77,85,,,Y,74213,Rbm26,CCGGGCTGTGAATACAAAGAGTTATCTCGAGATAACTCTTTGTATTCACAGCTTTTTG,AATTCAAAAAGCTGTGAATACAAAGAGTTATCTCGAGATAACTCTTTGTATTCACAGC,n/a
